{"text_format":"1","workbook":"xlsx","n_sheets":8,"sheets":["PODEŠAVANJA-NE BRISATI","PODESAVANJE","UPIS DECACI GT","PRIPREMA ","Zreb CEO 10","TABELA 10","RADNI 10","RASPORED ZREB 10"],"not_rendered":{"charts":0,"images":90,"macros":1,"external_links":3,"defined_names":21,"comments":0,"pivot_tables":0},"unopened":[],"bounds":{"document_bytes":16777216,"sheet_cells":100000,"rows_first":2000,"rows_last":500,"rows_between":2000,"halvings":0,"cell_chars":16384,"cell_head_chars":4096},"cells_cut":0,"cells_raw":0,"read":"whole","date_system":"1900"}

{"sheet":"PODEŠAVANJA-NE BRISATI","index":0,"n_rows":63,"n_cols":79,"rows_kept":63,"cut":false,"hidden":true,"merged":[[37,0,38,1],[21,52,21,53],[23,0,24,0],[23,1,24,1],[23,2,23,11],[23,12,23,21],[24,2,24,5],[24,6,24,8],[24,9,24,11],[13,6,13,7],[4,74,5,74],[4,76,5,76],[4,78,5,78],[5,0,5,1],[8,2,8,5],[8,6,8,7],[8,8,8,9],[4,72,5,72],[9,2,9,5],[9,6,9,7],[9,8,9,9],[11,6,11,7],[12,6,12,7],[0,0,0,9],[1,0,1,9],[3,0,3,9],[3,55,3,56],[4,2,7,9]]}
["TURNIRSKA PODEŠAVANJA",null,null,null,null,null,null,null,null,null,null,null,null,null,null,null,null,null,null,null,null,null,null,null,null,null,null,null,null,null,null,null,null,null,null,null,null,null,null,null,null,null,null,null,null,null,null,null,null,null,null,null,null,null,null,null,null,null,null,null,null,null,"01",{"$f":"CONCATENATE(BK1,$BJ$4)","v":"01m"},{"$f":"CONCATENATE(BK1,$BJ$5)","v":"01z"},{"$f":"CONCATENATE(BK1,$BJ$6)","v":"01mq"},{"$f":"CONCATENATE(BK1,$BJ$7)","v":"01zq"},{"$f":"CONCATENATE(BK1,$BJ$8)","v":"01md"},{"$f":"CONCATENATE(BK1,$BJ$9)","v":"01zd"}]
["NE BRIŠITE OVU STRANU!!!",null,null,null,null,null,null,null,null,null,null,null,null,null,null,null,null,null,null,null,null,null,null,null,null,null,null,null,null,null,null,null,null,null,null,null,null,null,null,null,null,null,null,null,null,null,null,null,null,null,null,null,null,null,null,null,null,null,null,null,null,null,"02","02m","02z","02mq","02zq","02md","02zd"]
[null,null,null,null,null,null,null,null,null,null,null,null,null,null,null,null,null,null,null,null,null,null,null,null,null,null,null,null,null,null,null,null,null,null,null,null,null,null,null,null,null,null,null,null,null,null,null,null,null,null,null,null,null,null,null,null,null,null,null,null,null,null,"03","03m","03z","03mq","03zq","03md","03zd"]
["POPUNITE SVA POLJA KOJA SU ZELENA",null,null,null,null,null,null,null,null,null,null,null,null,null,null,null,null,null,null,null,null,null,null,null,null,null,null,null,null,null,null,null,null,null,null,null,null,null,null,null,null,null,null,null,null,null,null,null,null,null,null,null,null,null,null,"Uzrast",null,null,null,null,null,"m","04","04m","04z","04mq","04zq","04md","04zd"]
["IME TURNIRA",null,"KORISTITE EXCEL 2010 I NOVIJI",null,null,null,null,null,null,null,null,null,null,null,null,null,null,null,null,null,null,null,null,null,null,null,null,null,null,null,null,null,null,null,null,null,null,null,null,null,null,null,null,null,null,null,null,null,null,null,null,null,null,null,null,"DEČACI","DEVOJČICE",null,null,null,null,"z","05","05m","05z","05mq","05zq","05md","05zd",null,null,null,"PRIPREMA DECACI GT",null,"PRIPREMA DECACI KV",null,"PRIPREMA DEVOJCICE GT",null,"PRIPREMA DEVOJCICE KV"]
["OP BEOGRADA",null,null,null,null,null,null,null,null,null,null,null,null,null,null,null,null,null,null,null,null,null,null,null,null,null,null,null,null,null,null,null,null,null,null,null,null,null,null,null,null,null,null,null,null,null,null,null,null,null,null,null,null,null,null,"JUNIORI","JUNIORKE",null,null,null,null,"mq","06","06m","06z","06mq","06zq","06md","06zd"]
[null,null,null,null,null,null,null,null,null,null,null,null,null,null,null,null,null,null,null,null,null,null,null,null,null,null,null,null,null,null,null,null,null,null,null,null,null,null,null,null,null,null,null,null,null,null,null,null,null,null,null,null,null,null,null,"MUŠKARCI","ŽENE",null,null,null,null,"zq","07","07m","07z","07mq","07zq","07md","07zd",null,null,null,{"$f":"IF(AND(ISTEXT('[1]PRIPREMA DECACI GT'!B8),ISNUMBER('PODEŠAVANJA-NE BRISATI'!$D$13)),'[1]PRIPREMA DECACI GT'!A8,\"\")","v":1},null,{"$f":"IF(OR(ISNUMBER('[1]PRIPREMA DECACI KV'!H8),ISTEXT('[1]PRIPREMA DECACI KV'!H8)),'[1]PRIPREMA DECACI KV'!A8,\"\")","v":1},null,{"$f":"IF(AND(ISTEXT('[1]PRIPREMA DEVOJCICE GT'!B8),ISNUMBER('PODEŠAVANJA-NE BRISATI'!$D$14)),'[1]PRIPREMA DEVOJCICE GT'!A8,\"\")","v":""},null,{"$f":"IF(OR(ISNUMBER('[1]PRIPREMA DEVOJCICE KV'!H8),ISTEXT('[1]PRIPREMA DEVOJCICE KV'!H8)),'[1]PRIPREMA DEVOJCICE KV'!A8,\"\")","v":1}]
["Teniski savez Srbije",null,null,null,null,null,null,null,null,null,null,null,null,null,null,null,null,null,null,null,null,null,null,null,null,null,null,null,null,null,null,null,null,null,null,null,null,null,null,null,null,null,null,null,null,null,null,null,null,null,null,null,null,null,null,null,null,null,null,null,null,"md","08","08m","08z","08mq","08zq","08md","08zd",null,null,null,{"$f":"IF(AND(ISTEXT('[1]PRIPREMA DECACI GT'!B9),ISNUMBER('PODEŠAVANJA-NE BRISATI'!$D$13)),'[1]PRIPREMA DECACI GT'!A9,\"\")","v":2},null,{"$f":"IF(OR(ISNUMBER('[1]PRIPREMA DECACI KV'!H9),ISTEXT('[1]PRIPREMA DECACI KV'!H9)),'[1]PRIPREMA DECACI KV'!A9,\"\")","v":2},null,{"$f":"IF(AND(ISTEXT('[1]PRIPREMA DEVOJCICE GT'!B9),ISNUMBER('PODEŠAVANJA-NE BRISATI'!$D$14)),'[1]PRIPREMA DEVOJCICE GT'!A9,\"\")","v":""},null,{"$f":"IF(OR(ISNUMBER('[1]PRIPREMA DEVOJCICE KV'!H9),ISTEXT('[1]PRIPREMA DEVOJCICE KV'!H9)),'[1]PRIPREMA DEVOJCICE KV'!A9,\"\")","v":2}]
{"$rows_left_out":56}
{"sheet":"PODESAVANJE","index":1,"n_rows":0,"n_cols":0,"rows_kept":0,"cut":false,"hidden":true,"merged":[]}

{"sheet":"UPIS DECACI GT","index":2,"n_rows":207,"n_cols":18,"rows_kept":207,"cut":false,"hidden":true,"merged":[[0,3,0,6],[3,0,3,1]]}
[{"$f":"'[1]PODEŠAVANJA-NE BRISATI'!$A$6","v":"OP BEOGRADA"}]
[{"$f":"'[1]PODEŠAVANJA-NE BRISATI'!$A$8","v":"Teniski savez Srbije"}]
["DATUM",null,"GRAD, KLUB",null,null,"KATEGORIJA","KONKURENCIJA",null,null,"VRHOVNI SUDIJA","POTPIS VRHOVNOG SUDIJE"]
[]
[null,null,"DAN","DATUM",null,"VREME","MESTO"]
["KRAJNJI ROK ZA UPIS:"]
["BROJ","PREZIME","IME","KLUB","DATUM RODJENJA","POTPIS IGRACA","TAKMICARSKA LEGITIMACIJA",null,null,null,null,null,null,null,null,"RANG","STATUS","NOSIOC"]
[1]
{"$rows_left_out":200}
{"sheet":"PRIPREMA ","index":3,"n_rows":136,"n_cols":30,"rows_kept":136,"cut":false,"hidden":false,"merged":[[4,0,4,1]]}
[]
[]
[null,null,null,null,null,null,null,null,null,null,null,null,null,null,null,null,null,null,null,"Over 18",{"$f":"YEAR($A$5)-18","v":1882}]
[null,null,null,null,null,null,null,null,null,null,null,null,null,null,null,null,null,null,null,"Under 13",{"$f":"YEAR($A$5)-13","v":1887}]
[null,null,null,null,null,null,{"$f":"'[2]PODEŠAVANJA-NE BRISATI'!$A$12","v":0}]
["BROJ","PREZIME","IME","KLUB","Date of Birth\ndd mmm yy","TAKMIČARSKA",null,"RANG",null,null,null,null,"Seed Sort",null,null,"RANG NOSIOCA","AccSort","POZICIJA NOSIOCA",null,null,null,null,null,null,null,null,null,null,"II","III"]
["B","BYE",null,null,null,null,null,0,null,null,null,null,null,null,null,0,null,null,null,null,null,{"$f":"B8&\" \"&C8","v":"Ristic Ognjen"},{"$f":"IF(AND(OR($D$5=4,$D$5=\"IV\",$D$5=\"IV\"),H7>0,H7<21,$G$5<>\"sen\"),\"NE MOZE DA IGRA!!!\",IF(AND(OR($D$5=3,$D$5=\"lll\",$D$5=\"III\"),H7>0,H7<11,$G$5<>\"sen\"),\"NE MOZE DA IGRA!!!\",\"\"))","v":""},null,{"$f":"IF(ISNUMBER(H7),H7,MID(AB7,5,5))","v":0},{"$f":"IF(AB7=\"tss\",Y7+10000,Y7)","v":10000},null,{"$f":"IF(ISNUMBER(H7),\"tss\",H7)","v":"tss"}]
[1,"Ristic","Ognjen","SLA","21.8.2009",17926,null,39,null,null,null,null,null,null,"DA",39,null,1,null,null,null,{"$f":"B8&\" \"&C8","v":"Ristic Ognjen"},{"$f":"IF(OR(ISBLANK(H8),H8=0),\"\",IF(AND($D$5=\"lll\",$G$5<>\"sen\"),AD8,IF(AND($D$5=\"ll\",$G$5<>\"sen\"),AC8,\"\")))","v":""},null,{"$f":"IF(OR(H8=0,ISBLANK(H8)),1000+A8,IF(ISNUMBER(H8),H8,MID(H8,4,5)))","v":39},{"$f":"IF(AB8=\"tss\",Y8+100000,IF(AB8=\"te\",Y8+50000,IF(AB8=\"itf\",Y8+10000,Y8)))","v":100039},null,{"$f":"IF(ISNUMBER(H8),\"tss\",LEFT(H8,FIND(\" \",H8)-1))","v":"tss"},{"$f":"IF(AB8=\"atp\",\"NE MOŽE DA IGRA!!!\",IF(AND(AB8=\"itf\",Z8<10201),\"NE MOŽE DA IGRA!!!\",IF(AND(AB8=\"TE\",Z8<50201),\"NE MOŽE DA IGRA!!!\",IF(AND(AB8=\"TSS\",Z8<100011),\"NE MOŽE DA IGRA!!!\",\"\"))))","v":""},{"$f":"IF(AB8=\"atp\",\"NE MOŽE DA IGRA!!!\",IF(AND(AB8=\"itf\",Z8<10201),\"NE MOŽE DA IGRA!!!\",IF(AND(AB8=\"TE\",Z8<50201),\"NE MOŽE DA IGRA!!!\",IF(AND(AB8=\"TSS\",Z8<100021),\"NE MOŽE DA IGRA!!!\",\"\"))))","v":""}]
{"$rows_left_out":129}
{"sheet":"Zreb CEO 10","index":4,"n_rows":37,"n_cols":21,"rows_kept":37,"cut":false,"hidden":false,"merged":[[30,16,31,16],[30,10,30,15],[30,2,30,7],[1,0,1,20],[11,0,11,20],[20,0,20,20],[29,0,29,20],[2,10,2,15],[12,10,12,15],[12,2,12,7],[21,2,21,7],[21,10,21,15],[2,2,2,7],[2,16,3,16],[12,16,13,16],[21,16,22,16]]}
[]
["KOLO 1"]
[null,null,"IGRAC  1",null,null,null,null,null,null,null,"IGRAC 2",null,null,null,null,null,"POBEDNIK\n1 ILI 2"]
[null,"sifra igrac1","PREZIME","IME","KLUB","DATUM ROĐENJA","TAKMIČARSKA LEGITIMACIJA",{"$f":"C4&\" \"&D4&\" (\"&E4&\")\"","v":"PREZIME IME (KLUB)"},null,"sifra igrac2","PREZIME","IME","KLUB","DATUM ROĐENJA","TAKMIČARSKA LEGITIMACIJA",{"$f":"K4&\" \"&L4&\" (\"&M4&\")\"","v":"PREZIME IME (KLUB)"},null,"sifra w","sifra L","POBEDNIK","REZULTAT"]
["MEC 1",null,{"$f":"UPPER(IF(($B5=0) + ($B5=\" \"),\"\",VLOOKUP($B5,'PRIPREMA '!$A$8:$C$24,2)))","v":""},{"$f":"UPPER(IF(($B5=0) + ($B5=\" \"),\"\",VLOOKUP($B5,'PRIPREMA '!$A$8:$C$24,3)))","v":""},{"$f":"UPPER(IF(($B5=0) + ($B5=\" \"),\"\",\"(\"&(VLOOKUP($B5,'PRIPREMA '!$A$8:$E$24,4)&\")\")))","v":""},{"$f":"UPPER(IF(($B5=0) + ($B5=\" \"),\"\",VLOOKUP($B5,'PRIPREMA '!$A$8:$E$24,5)))","v":""},{"$f":"UPPER(IF(($B5=0) + ($B5=\" \"),\"\",VLOOKUP($B5,'PRIPREMA '!$A$8:$G$24,6)))","v":""},"Ristic Ognjen (SLA)","VS",null,{"$f":"UPPER(IF(($J5=0) + ($J5=\" \"),\"\",VLOOKUP($J5,'PRIPREMA '!$A$8:$C$24,2)))","v":""},{"$f":"UPPER(IF(($J5=0) + ($J5=\" \"),\"\",VLOOKUP($J5,'PRIPREMA '!$A$8:$C$24,3)))","v":""},{"$f":"UPPER(IF(($J5=0) + ($J5=\" \"),\"\",\"(\"&(VLOOKUP($J5,'PRIPREMA '!$A$8:$F$24,4)&\")\")))","v":""},null,{"$f":"UPPER(IF(($J5=0) + ($J5=\" \"),\"\",VLOOKUP($J5,'PRIPREMA '!$A$8:$F$24,6)))","v":""},"Stepanovic Novak (AST)",null,{"$f":"IF($Q5=1,$B5,IF($Q5=2,$J5,\" \"))","v":" "},{"$f":"IF($Q5=1,$J5,IF($Q5=2,$B5,\" \"))","v":" "},{"$f":"UPPER(IF(($R5=0)+($R5=\" \"),\"\",(VLOOKUP($R5,'PRIPREMA '!$A$8:$H$24,2)&\" \"&(VLOOKUP($R5,'PRIPREMA '!$A$8:$H$24,3)&\" (\"&(VLOOKUP($R5,'PRIPREMA '!$A$8:$H$24,4)&\")\")))))","v":""}]
["MEC 2",null,{"$f":"UPPER(IF(($B6=0) + ($B6=\" \"),\"\",VLOOKUP($B6,'PRIPREMA '!$A$8:$C$24,2)))","v":""},{"$f":"UPPER(IF(($B6=0) + ($B6=\" \"),\"\",VLOOKUP($B6,'PRIPREMA '!$A$8:$C$24,3)))","v":""},{"$f":"UPPER(IF(($B6=0) + ($B6=\" \"),\"\",\"(\"&(VLOOKUP($B6,'PRIPREMA '!$A$8:$E$24,4)&\")\")))","v":""},{"$f":"UPPER(IF(($B6=0) + ($B6=\" \"),\"\",VLOOKUP($B6,'PRIPREMA '!$A$8:$E$24,5)))","v":""},{"$f":"UPPER(IF(($B6=0) + ($B6=\" \"),\"\",VLOOKUP($B6,'PRIPREMA '!$A$8:$G$24,6)))","v":""},"Aleksic Jovan (TOP)","VS",null,{"$f":"UPPER(IF(($J6=0) + ($J6=\" \"),\"\",VLOOKUP($J6,'PRIPREMA '!$A$8:$C$24,2)))","v":""},{"$f":"UPPER(IF(($J6=0) + ($J6=\" \"),\"\",VLOOKUP($J6,'PRIPREMA '!$A$8:$C$24,3)))","v":""},{"$f":"UPPER(IF(($J6=0) + ($J6=\" \"),\"\",\"(\"&(VLOOKUP($J6,'PRIPREMA '!$A$8:$F$24,4)&\")\")))","v":""},null,{"$f":"UPPER(IF(($J6=0) + ($J6=\" \"),\"\",VLOOKUP($J6,'PRIPREMA '!$A$8:$F$24,6)))","v":""},"Milic Milos (SLA)",null," "," ",{"$f":"UPPER(IF(($R6=0)+($R6=\" \"),\"\",(VLOOKUP($R6,'PRIPREMA '!$A$8:$H$24,2)&\" \"&(VLOOKUP($R6,'PRIPREMA '!$A$8:$H$24,3)&\" (\"&(VLOOKUP($R6,'PRIPREMA '!$A$8:$H$24,4)&\")\")))))","v":""}]
["MEC 3",null,{"$f":"UPPER(IF(($B7=0) + ($B7=\" \"),\"\",VLOOKUP($B7,'PRIPREMA '!$A$8:$C$24,2)))","v":""},{"$f":"UPPER(IF(($B7=0) + ($B7=\" \"),\"\",VLOOKUP($B7,'PRIPREMA '!$A$8:$C$24,3)))","v":""},{"$f":"UPPER(IF(($B7=0) + ($B7=\" \"),\"\",\"(\"&(VLOOKUP($B7,'PRIPREMA '!$A$8:$E$24,4)&\")\")))","v":""},{"$f":"UPPER(IF(($B7=0) + ($B7=\" \"),\"\",VLOOKUP($B7,'PRIPREMA '!$A$8:$E$24,5)))","v":""},{"$f":"UPPER(IF(($B7=0) + ($B7=\" \"),\"\",VLOOKUP($B7,'PRIPREMA '!$A$8:$G$24,6)))","v":""},"Mladenovic Janko (AST)","VS",null,{"$f":"UPPER(IF(($J7=0) + ($J7=\" \"),\"\",VLOOKUP($J7,'PRIPREMA '!$A$8:$C$24,2)))","v":""},{"$f":"UPPER(IF(($J7=0) + ($J7=\" \"),\"\",VLOOKUP($J7,'PRIPREMA '!$A$8:$C$24,3)))","v":""},{"$f":"UPPER(IF(($J7=0) + ($J7=\" \"),\"\",\"(\"&(VLOOKUP($J7,'PRIPREMA '!$A$8:$F$24,4)&\")\")))","v":""},null,{"$f":"UPPER(IF(($J7=0) + ($J7=\" \"),\"\",VLOOKUP($J7,'PRIPREMA '!$A$8:$F$24,6)))","v":""},"Stanimirovic Vukan (SLA)",null," "," ",{"$f":"UPPER(IF(($R7=0)+($R7=\" \"),\"\",(VLOOKUP($R7,'PRIPREMA '!$A$8:$H$24,2)&\" \"&(VLOOKUP($R7,'PRIPREMA '!$A$8:$H$24,3)&\" (\"&(VLOOKUP($R7,'PRIPREMA '!$A$8:$H$24,4)&\")\")))))","v":""}]
["MEC 4",null,{"$f":"UPPER(IF(($B8=0) + ($B8=\" \"),\"\",VLOOKUP($B8,'PRIPREMA '!$A$8:$C$24,2)))","v":""},{"$f":"UPPER(IF(($B8=0) + ($B8=\" \"),\"\",VLOOKUP($B8,'PRIPREMA '!$A$8:$C$24,3)))","v":""},{"$f":"UPPER(IF(($B8=0) + ($B8=\" \"),\"\",\"(\"&(VLOOKUP($B8,'PRIPREMA '!$A$8:$E$24,4)&\")\")))","v":""},{"$f":"UPPER(IF(($B8=0) + ($B8=\" \"),\"\",VLOOKUP($B8,'PRIPREMA '!$A$8:$E$24,5)))","v":""},{"$f":"UPPER(IF(($B8=0) + ($B8=\" \"),\"\",VLOOKUP($B8,'PRIPREMA '!$A$8:$G$24,6)))","v":""},"Jovanovic Filip (TAZ)","VS",null,{"$f":"UPPER(IF(($J8=0) + ($J8=\" \"),\"\",VLOOKUP($J8,'PRIPREMA '!$A$8:$C$24,2)))","v":""},{"$f":"UPPER(IF(($J8=0) + ($J8=\" \"),\"\",VLOOKUP($J8,'PRIPREMA '!$A$8:$C$24,3)))","v":""},{"$f":"UPPER(IF(($J8=0) + ($J8=\" \"),\"\",\"(\"&(VLOOKUP($J8,'PRIPREMA '!$A$8:$F$24,4)&\")\")))","v":""},null,{"$f":"UPPER(IF(($J8=0) + ($J8=\" \"),\"\",VLOOKUP($J8,'PRIPREMA '!$A$8:$F$24,6)))","v":""},"Vujcic Veljko (SLA)",null," "," ",{"$f":"UPPER(IF(($R8=0)+($R8=\" \"),\"\",(VLOOKUP($R8,'PRIPREMA '!$A$8:$H$24,2)&\" \"&(VLOOKUP($R8,'PRIPREMA '!$A$8:$H$24,3)&\" (\"&(VLOOKUP($R8,'PRIPREMA '!$A$8:$H$24,4)&\")\")))))","v":""}]
{"$rows_left_out":30}
{"sheet":"TABELA 10","index":5,"n_rows":20,"n_cols":6,"rows_kept":20,"cut":false,"hidden":false,"merged":[]}
[]
[]
[]
[null,null,"Pozicija","Prezime ","Ime","Bodovi"]
[null,null,1,{"$f":"'RADNI 10'!J4","v":"Ristic"},{"$f":"'RADNI 10'!K4","v":"Ognjen"},{"$f":"'RADNI 10'!L4","v":0}]
[null,null,2,{"$f":"'RADNI 10'!J5","v":"Mladenovic"},{"$f":"'RADNI 10'!K5","v":"Janko"},{"$f":"'RADNI 10'!L5","v":0}]
[null,null,3,{"$f":"'RADNI 10'!J6","v":"Aleksic"},{"$f":"'RADNI 10'!K6","v":"Jovan"},{"$f":"'RADNI 10'!L6","v":0}]
[null,null,4,{"$f":"'RADNI 10'!J7","v":"Djordjevic "},{"$f":"'RADNI 10'!K7","v":"Veljko"},{"$f":"'RADNI 10'!L7","v":0}]
{"$rows_left_out":13}
{"sheet":"RADNI 10","index":6,"n_rows":24,"n_cols":17,"rows_kept":24,"cut":false,"hidden":true,"merged":[]}
[]
[null,null,"BODOVI",15]
[null,null,"rang","Pozicija","Prezime ","Ime","Bodovi",null,"Pozicija","Prezime ","Ime","Bodovi"]
[null,{"$f":"RANK($G4,$G$4:$G$23)+SUMPRODUCT(--($C4>$C$4:$C$23),--($G$4:$G$23=$G4))","v":{"$error":"#N/A"}},10,{"$f":"RANK($G4,$G$4:$G$23)+SUMPRODUCT(--($C4>$C$4:$C$23),--($G$4:$G$23=$G4))","v":{"$error":"#N/A"}},null,null,null,null,1,{"$f":"IFERROR(VLOOKUP($I4,$M$4:$P$19,2,FALSE),VLOOKUP($I4,$M$4:$P$19,2,TRUE))","v":"Ristic"},{"$f":"IFERROR(VLOOKUP($I4,$M$4:$P$19,3,FALSE),VLOOKUP($I4,$M$4:$P$19,3,TRUE))","v":"Ognjen"},{"$f":"IFERROR(VLOOKUP($I4,$M$4:$P$19,4,FALSE),VLOOKUP($I4,$M$4:$P$19,4,TRUE))","v":0},{"$f":"RANK($P4,$P$4:$P$19)+SUMPRODUCT(--($C4>$C$4:$C$19),--($P$4:$P$19=$P4))","v":1},{"$f":"'PRIPREMA '!$B8","v":"Ristic"},{"$f":"'PRIPREMA '!$C8","v":"Ognjen"},{"$f":"Q4*$D$2","v":0},{"$f":"COUNTIFS('Zreb CEO 10'!R:R,'PRIPREMA '!A8)","v":0}]
[null,{"$f":"RANK(G5,$G$4:$G$23)+SUMPRODUCT(--(C5>$C$4:$C$23),--($G$4:$G$23=G5))","v":{"$error":"#N/A"}},11,{"$error":"#N/A"},null,null,null,null,2,{"$f":"IFERROR(VLOOKUP($I5,$M$4:$P$19,2,FALSE),VLOOKUP($I5,$M$4:$P$19,2,TRUE))","v":"Mladenovic"},{"$f":"IFERROR(VLOOKUP($I5,$M$4:$P$19,3,FALSE),VLOOKUP($I5,$M$4:$P$19,3,TRUE))","v":"Janko"},{"$f":"IFERROR(VLOOKUP($I5,$M$4:$P$19,4,FALSE),VLOOKUP($I5,$M$4:$P$19,4,TRUE))","v":0},{"$f":"RANK($P5,$P$4:$P$19)+SUMPRODUCT(--($C5>$C$4:$C$19),--($P$4:$P$19=$P5))","v":2},{"$f":"'PRIPREMA '!$B9","v":"Mladenovic"},{"$f":"'PRIPREMA '!$C9","v":"Janko"},{"$f":"Q5*$D$2","v":0},{"$f":"COUNTIFS('Zreb CEO 10'!R:R,'PRIPREMA '!A9)","v":0}]
[null,{"$error":"#N/A"},12,{"$error":"#N/A"},null,null,null,null,3,"Aleksic","Jovan",0,3,{"$f":"'PRIPREMA '!$B10","v":"Aleksic"},{"$f":"'PRIPREMA '!$C10","v":"Jovan"},0,{"$f":"COUNTIFS('Zreb CEO 10'!R:R,'PRIPREMA '!A10)","v":0}]
[null,{"$error":"#N/A"},13,{"$error":"#N/A"},null,null,null,null,4,"Djordjevic ","Veljko",0,4,{"$f":"'PRIPREMA '!$B11","v":"Djordjevic "},{"$f":"'PRIPREMA '!$C11","v":"Veljko"},0,{"$f":"COUNTIFS('Zreb CEO 10'!R:R,'PRIPREMA '!A11)","v":0}]
[null,{"$error":"#N/A"},14,{"$error":"#N/A"},null,null,null,null,5,"Stanimirovic","Rastko",0,5,{"$f":"'PRIPREMA '!$B12","v":"Stanimirovic"},{"$f":"'PRIPREMA '!$C12","v":"Rastko"},0,{"$f":"COUNTIFS('Zreb CEO 10'!R:R,'PRIPREMA '!A12)","v":0}]
{"$rows_left_out":17}
{"sheet":"RASPORED ZREB 10","index":7,"n_rows":474,"n_cols":32,"rows_kept":474,"cut":false,"hidden":false,"merged":[[69,5,69,9],[69,10,69,14],[70,5,70,9],[70,10,70,14],[72,10,73,11],[72,12,73,14],[66,5,66,9],[66,10,66,14],[67,6,67,8],[67,11,67,13],[68,5,68,9],[68,10,68,14],[63,5,63,9],[63,10,63,14],[64,5,64,9],[64,10,64,14],[65,5,65,9],[65,10,65,14],[60,5,60,9],[60,10,60,14],[61,5,61,9],[61,10,61,14],[62,5,62,9],[62,10,62,14],[57,5,57,9],[57,10,57,14],[58,5,58,9],[58,10,58,14],[59,6,59,8],[59,11,59,13],[54,5,54,9],[54,10,54,14],[55,5,55,9],[55,10,55,14],[56,5,56,9],[56,10,56,14],[51,6,51,8],[51,11,51,13],[52,5,52,9],[52,10,52,14],[53,5,53,9],[53,10,53,14],[48,5,48,9],[48,10,48,14],[49,5,49,9],[49,10,49,14],[50,5,50,9],[50,10,50,14],[45,5,45,9],[45,10,45,14],[46,5,46,9],[46,10,46,14],[47,5,47,9],[47,10,47,14],[42,5,42,9],[42,10,42,14],[43,6,43,8],[43,11,43,13],[44,5,44,9],[44,10,44,14],[39,5,39,9],[39,10,39,14],[40,5,40,9],[40,10,40,14],[41,5,41,9],[41,10,41,14],[36,5,36,9],[36,10,36,14],[37,5,37,9],[37,10,37,14],[38,5,38,9],[38,10,38,14],[33,5,33,9],[33,10,33,14],[34,5,34,9],[34,10,34,14],[35,6,35,8],[35,11,35,13],[30,5,30,9],[30,10,30,14],[31,5,31,9],[31,10,31,14],[32,5,32,9],[32,10,32,14],[27,6,27,8],[27,11,27,13],[28,5,28,9],[28,10,28,14],[29,5,29,9],[29,10,29,14],[24,5,24,9],[24,10,24,14],[25,5,25,9],[25,10,25,14],[26,5,26,9],[26,10,26,14],[21,5,21,9],[21,10,21,14],[22,5,22,9],[22,10,22,14],[23,5,23,9],[23,10,23,14],[18,5,18,9],[18,10,18,14],[19,6,19,8],[19,11,19,13],[20,5,20,9],[20,10,20,14],[15,5,15,9],[15,10,15,14],[16,5,16,9],[16,10,16,14],[17,5,17,9],[17,10,17,14],[12,5,12,9],[12,10,12,14],[13,5,13,9],[13,10,13,14],[14,5,14,9],[14,10,14,14],[10,5,10,9],[10,10,10,14],[11,6,11,8],[11,11,11,13],[6,5,6,9],[6,10,6,14],[7,5,7,9],[7,10,7,14],[8,5,8,9],[8,10,8,14],[1,4,2,7],[1,8,1,11],[2,8,3,11],[4,6,4,7],[4,8,4,9],[5,6,5,7],[5,8,5,9],[9,5,9,9],[9,10,9,14]]}
[]
[null,null,null,null,null,null,null,null,"DAN, DATUM"]
[]
[null,null,null,null,{"$f":"'[1]PODEŠAVANJA-NE BRISATI'!$A$8","v":"Teniski savez Srbije"}]
[null,null,null,null,"DATUM",null,"GRAD, KLUB",null,"KATEGORIJA",null,null,"KONKURENCIJA",null,null,"VRHOVNI SUDIJA"]
[]
[null,null,null,null,null,"TEREN 1",null,null,null,null,"TEREN 2"]
[null,null,null,null,null,"POČETAK U: 10H",null,null,null,null,"POČETAK U: 10H"]
{"$rows_left_out":466}