{"text_format":"1","workbook":"xlsx","n_sheets":8,"sheets":["PODEŠAVANJA-NE BRISATI","PODESAVANJE","UPIS DECACI GT","PRIPREMA ","Zreb CEO 10","TABELA 10","RADNI 10","RASPORED ZREB 10"],"not_rendered":{"charts":0,"images":90,"macros":1,"external_links":3,"defined_names":21,"comments":0,"pivot_tables":0},"unopened":[],"bounds":{"document_bytes":16777216,"sheet_cells":100000,"rows_first":2000,"rows_last":500,"rows_between":2000,"halvings":0,"cell_chars":16384,"cell_head_chars":4096},"cells_cut":0,"cells_raw":0,"read":"whole","date_system":"1900"}

{"sheet":"PODEŠAVANJA-NE BRISATI","index":0,"n_rows":63,"n_cols":79,"rows_kept":63,"cut":false,"hidden":true,"merged":[[37,0,38,1],[21,52,21,53],[23,0,24,0],[23,1,24,1],[23,2,23,11],[23,12,23,21],[24,2,24,5],[24,6,24,8],[24,9,24,11],[13,6,13,7],[4,74,5,74],[4,76,5,76],[4,78,5,78],[5,0,5,1],[8,2,8,5],[8,6,8,7],[8,8,8,9],[4,72,5,72],[9,2,9,5],[9,6,9,7],[9,8,9,9],[11,6,11,7],[12,6,12,7],[0,0,0,9],[1,0,1,9],[3,0,3,9],[3,55,3,56],[4,2,7,9]]}
["TURNIRSKA PODEŠAVANJA",null,null,null,null,null,null,null,null,null,null,null,null,null,null,null,null,null,null,null,null,null,null,null,null,null,null,null,null,null,null,null,null,null,null,null,null,null,null,null,null,null,null,null,null,null,null,null,null,null,null,null,null,null,null,null,null,null,null,null,null,null,"01",{"$f":"CONCATENATE(BK1,$BJ$4)","v":"01m"},{"$f":"CONCATENATE(BK1,$BJ$5)","v":"01z"},{"$f":"CONCATENATE(BK1,$BJ$6)","v":"01mq"},{"$f":"CONCATENATE(BK1,$BJ$7)","v":"01zq"},{"$f":"CONCATENATE(BK1,$BJ$8)","v":"01md"},{"$f":"CONCATENATE(BK1,$BJ$9)","v":"01zd"}]
["NE BRIŠITE OVU STRANU!!!",null,null,null,null,null,null,null,null,null,null,null,null,null,null,null,null,null,null,null,null,null,null,null,null,null,null,null,null,null,null,null,null,null,null,null,null,null,null,null,null,null,null,null,null,null,null,null,null,null,null,null,null,null,null,null,null,null,null,null,null,null,"02","02m","02z","02mq","02zq","02md","02zd"]
[null,null,null,null,null,null,null,null,null,null,null,null,null,null,null,null,null,null,null,null,null,null,null,null,null,null,null,null,null,null,null,null,null,null,null,null,null,null,null,null,null,null,null,null,null,null,null,null,null,null,null,null,null,null,null,null,null,null,null,null,null,null,"03","03m","03z","03mq","03zq","03md","03zd"]
["POPUNITE SVA POLJA KOJA SU ZELENA",null,null,null,null,null,null,null,null,null,null,null,null,null,null,null,null,null,null,null,null,null,null,null,null,null,null,null,null,null,null,null,null,null,null,null,null,null,null,null,null,null,null,null,null,null,null,null,null,null,null,null,null,null,null,"Uzrast",null,null,null,null,null,"m","04","04m","04z","04mq","04zq","04md","04zd"]
["IME TURNIRA",null,"KORISTITE EXCEL 2010 I NOVIJI",null,null,null,null,null,null,null,null,null,null,null,null,null,null,null,null,null,null,null,null,null,null,null,null,null,null,null,null,null,null,null,null,null,null,null,null,null,null,null,null,null,null,null,null,null,null,null,null,null,null,null,null,"DEČACI","DEVOJČICE",null,null,null,null,"z","05","05m","05z","05mq","05zq","05md","05zd",null,null,null,"PRIPREMA DECACI GT",null,"PRIPREMA DECACI KV",null,"PRIPREMA DEVOJCICE GT",null,"PRIPREMA DEVOJCICE KV"]
["OP BEOGRADA",null,null,null,null,null,null,null,null,null,null,null,null,null,null,null,null,null,null,null,null,null,null,null,null,null,null,null,null,null,null,null,null,null,null,null,null,null,null,null,null,null,null,null,null,null,null,null,null,null,null,null,null,null,null,"JUNIORI","JUNIORKE",null,null,null,null,"mq","06","06m","06z","06mq","06zq","06md","06zd"]
[null,null,null,null,null,null,null,null,null,null,null,null,null,null,null,null,null,null,null,null,null,null,null,null,null,null,null,null,null,null,null,null,null,null,null,null,null,null,null,null,null,null,null,null,null,null,null,null,null,null,null,null,null,null,null,"MUŠKARCI","ŽENE",null,null,null,null,"zq","07","07m","07z","07mq","07zq","07md","07zd",null,null,null,{"$f":"IF(AND(ISTEXT('[1]PRIPREMA DECACI GT'!B8),ISNUMBER('PODEŠAVANJA-NE BRISATI'!$D$13)),'[1]PRIPREMA DECACI GT'!A8,\"\")","v":1},null,{"$f":"IF(OR(ISNUMBER('[1]PRIPREMA DECACI KV'!H8),ISTEXT('[1]PRIPREMA DECACI KV'!H8)),'[1]PRIPREMA DECACI KV'!A8,\"\")","v":1},null,{"$f":"IF(AND(ISTEXT('[1]PRIPREMA DEVOJCICE GT'!B8),ISNUMBER('PODEŠAVANJA-NE BRISATI'!$D$14)),'[1]PRIPREMA DEVOJCICE GT'!A8,\"\")","v":""},null,{"$f":"IF(OR(ISNUMBER('[1]PRIPREMA DEVOJCICE KV'!H8),ISTEXT('[1]PRIPREMA DEVOJCICE KV'!H8)),'[1]PRIPREMA DEVOJCICE KV'!A8,\"\")","v":1}]
["Teniski savez Srbije",null,null,null,null,null,null,null,null,null,null,null,null,null,null,null,null,null,null,null,null,null,null,null,null,null,null,null,null,null,null,null,null,null,null,null,null,null,null,null,null,null,null,null,null,null,null,null,null,null,null,null,null,null,null,null,null,null,null,null,null,"md","08","08m","08z","08mq","08zq","08md","08zd",null,null,null,{"$f":"IF(AND(ISTEXT('[1]PRIPREMA DECACI GT'!B9),ISNUMBER('PODEŠAVANJA-NE BRISATI'!$D$13)),'[1]PRIPREMA DECACI GT'!A9,\"\")","v":2},null,{"$f":"IF(OR(ISNUMBER('[1]PRIPREMA DECACI KV'!H9),ISTEXT('[1]PRIPREMA DECACI KV'!H9)),'[1]PRIPREMA DECACI KV'!A9,\"\")","v":2},null,{"$f":"IF(AND(ISTEXT('[1]PRIPREMA DEVOJCICE GT'!B9),ISNUMBER('PODEŠAVANJA-NE BRISATI'!$D$14)),'[1]PRIPREMA DEVOJCICE GT'!A9,\"\")","v":""},null,{"$f":"IF(OR(ISNUMBER('[1]PRIPREMA DEVOJCICE KV'!H9),ISTEXT('[1]PRIPREMA DEVOJCICE KV'!H9)),'[1]PRIPREMA DEVOJCICE KV'!A9,\"\")","v":2}]
["DATUM (PRVI DAN TURNIRA)",null,"GRAD, KLUB",null,null,null,"KATEGORIJA",null,"VRHOVNI SUDIJA",null,null,null,null,null,null,null,null,null,null,null,null,null,null,null,null,null,null,null,null,null,null,null,null,null,null,null,null,null,null,null,null,null,null,null,null,null,null,null,null,null,null,null,null,null,null,null,null,null,null,null,null,"zd","09","09m","09z","09mq","09zq","09md","09zd",null,null,null,{"$f":"IF(ISBLANK('[1]PRIPREMA DECACI GT'!B10),\"\",IF('PODEŠAVANJA-NE BRISATI'!$D$13>8,'[1]PRIPREMA DECACI GT'!A10,\"\"))","v":3},null,{"$f":"IF(OR(ISNUMBER('[1]PRIPREMA DECACI KV'!H10),ISTEXT('[1]PRIPREMA DECACI KV'!H10)),'[1]PRIPREMA DECACI KV'!A10,\"\")","v":3},null,{"$f":"IF(ISBLANK('[1]PRIPREMA DEVOJCICE GT'!B10),\"\",IF('PODEŠAVANJA-NE BRISATI'!$D$14>8,'[1]PRIPREMA DEVOJCICE GT'!A10,\"\"))","v":""},null,{"$f":"IF(OR(ISNUMBER('[1]PRIPREMA DEVOJCICE KV'!H10),ISTEXT('[1]PRIPREMA DEVOJCICE KV'!H10)),'[1]PRIPREMA DEVOJCICE KV'!A10,\"\")","v":3}]
["15.06.2020.",null,"OTK \"Beograd\"",null,null,null,"B",null,"Viktor Bubanj",null,null,null,null,null,null,null,null,null,null,null,null,null,null,null,null,null,null,null,null,null,null,null,null,null,null,null,null,null,null,null,null,null,null,null,null,null,null,null,null,null,null,null,null,null,"zreb singla","zreb dubla","zreb kvala",null,"raspored",null,null,null,"10","10m","10z","10mq","10zq","10md","10zd",null,null,null,{"$f":"IF(ISBLANK('[1]PRIPREMA DECACI GT'!B11),\"\",IF('PODEŠAVANJA-NE BRISATI'!$D$13>8,'[1]PRIPREMA DECACI GT'!A11,\"\"))","v":4},null,{"$f":"IF(OR(ISNUMBER('[1]PRIPREMA DECACI KV'!H11),ISTEXT('[1]PRIPREMA DECACI KV'!H11)),'[1]PRIPREMA DECACI KV'!A11,\"\")","v":4},null,{"$f":"IF(ISBLANK('[1]PRIPREMA DEVOJCICE GT'!B11),\"\",IF('PODEŠAVANJA-NE BRISATI'!$D$14>8,'[1]PRIPREMA DEVOJCICE GT'!A11,\"\"))","v":""},null,{"$f":"IF(OR(ISNUMBER('[1]PRIPREMA DEVOJCICE KV'!H11),ISTEXT('[1]PRIPREMA DEVOJCICE KV'!H11)),'[1]PRIPREMA DEVOJCICE KV'!A11,\"\")","v":4}]
["KONKURENCIJA",null,null,null,null,null,null,null,null,null,null,null,null,null,null,null,null,null,null,null,null,null,null,null,null,null,null,null,null,null,null,null,null,null,null,null,null,null,null,null,null,null,null,null,null,null,null,null,null,null,null,null,null,null,8,4,"8>4",null,"POČETAK U:",null,null,null,"11","11m","11z","11mq","11zq","11md","11zd",null,null,null,{"$f":"IF(ISBLANK('[1]PRIPREMA DECACI GT'!B12),\"\",IF('PODEŠAVANJA-NE BRISATI'!$D$13>16,'[1]PRIPREMA DECACI GT'!A12,\"\"))","v":5},null,{"$f":"IF(OR(ISNUMBER('[1]PRIPREMA DECACI KV'!H12),ISTEXT('[1]PRIPREMA DECACI KV'!H12)),'[1]PRIPREMA DECACI KV'!A12,\"\")","v":5},null,{"$f":"IF(ISBLANK('[1]PRIPREMA DEVOJCICE GT'!B12),\"\",IF('PODEŠAVANJA-NE BRISATI'!$D$14>16,'[1]PRIPREMA DEVOJCICE GT'!A12,\"\"))","v":""},null,{"$f":"IF(OR(ISNUMBER('[1]PRIPREMA DEVOJCICE KV'!H12),ISTEXT('[1]PRIPREMA DEVOJCICE KV'!H12)),'[1]PRIPREMA DEVOJCICE KV'!A12,\"\")","v":5}]
["Sen",null,null,"Singl","Dubl","Kvale","Uzrast",null,null,null,null,null,null,null,null,null,null,null,null,null,null,null,null,null,null,null,null,null,null,null,null,null,null,null,null,null,null,null,null,null,null,null,null,null,null,null,null,null,null,null,null,null,null,null,16,8,"16>4",null,"SLEDI",null,null,null,"12","12m","12z","12mq","12zq","12md","12zd",null,null,null,{"$f":"IF(ISBLANK('[1]PRIPREMA DECACI GT'!B13),\"\",IF('PODEŠAVANJA-NE BRISATI'!$D$13>16,'[1]PRIPREMA DECACI GT'!A13,\"\"))","v":6},null,{"$f":"IF(OR(ISNUMBER('[1]PRIPREMA DECACI KV'!H13),ISTEXT('[1]PRIPREMA DECACI KV'!H13)),'[1]PRIPREMA DECACI KV'!A13,\"\")","v":6},null,{"$f":"IF(ISBLANK('[1]PRIPREMA DEVOJCICE GT'!B13),\"\",IF('PODEŠAVANJA-NE BRISATI'!$D$14>16,'[1]PRIPREMA DEVOJCICE GT'!A13,\"\"))","v":""},null,{"$f":"IF(OR(ISNUMBER('[1]PRIPREMA DEVOJCICE KV'!H13),ISTEXT('[1]PRIPREMA DEVOJCICE KV'!H13)),'[1]PRIPREMA DEVOJCICE KV'!A13,\"\")","v":6}]
[null,null,"MUŠKI ŽREB  ",64,null,"16>4","MUŠKARCI",null,null,null,null,null,null,null,null,null,null,null,null,null,null,null,null,null,null,null,null,null,null,null,null,null,null,null,null,null,null,null,null,null,null,null,null,null,null,null,null,null,null,null,null,null,null,null,32,16,"32>4",null,"NE PRE:",null,null,null,"13","13m","13z","13mq","13zq","13md","13zd",null,null,null,{"$f":"IF(ISBLANK('[1]PRIPREMA DECACI GT'!B14),\"\",IF('PODEŠAVANJA-NE BRISATI'!$D$13>16,'[1]PRIPREMA DECACI GT'!A14,\"\"))","v":7},null,{"$f":"IF(OR(ISNUMBER('[1]PRIPREMA DECACI KV'!H14),ISTEXT('[1]PRIPREMA DECACI KV'!H14)),'[1]PRIPREMA DECACI KV'!A14,\"\")","v":7},null,{"$f":"IF(ISBLANK('[1]PRIPREMA DEVOJCICE GT'!B14),\"\",IF('PODEŠAVANJA-NE BRISATI'!$D$14>16,'[1]PRIPREMA DEVOJCICE GT'!A14,\"\"))","v":""},null,{"$f":"IF(OR(ISNUMBER('[1]PRIPREMA DEVOJCICE KV'!H14),ISTEXT('[1]PRIPREMA DEVOJCICE KV'!H14)),'[1]PRIPREMA DEVOJCICE KV'!A14,\"\")","v":7}]
[null,null,"ŽENSKI ŽREB  ",null,null,null,null,null,null,null,null,null,null,null,null,null,null,null,null,null,null,null,null,null,null,null,null,null,null,null,null,null,null,null,null,null,null,null,null,null,null,null,null,null,null,null,null,null,null,null,null,null,null,null,64,null,"16>8",null,"NAKON ODMORA, NE PRE:",null,null,null,"14","14m","14z","14mq","14zq","14md","14zd",null,null,null,{"$f":"IF(ISBLANK('[1]PRIPREMA DECACI GT'!B15),\"\",IF('PODEŠAVANJA-NE BRISATI'!$D$13>16,'[1]PRIPREMA DECACI GT'!A15,\"\"))","v":8},null,{"$f":"IF(OR(ISNUMBER('[1]PRIPREMA DECACI KV'!H15),ISTEXT('[1]PRIPREMA DECACI KV'!H15)),'[1]PRIPREMA DECACI KV'!A15,\"\")","v":8},null,{"$f":"IF(ISBLANK('[1]PRIPREMA DEVOJCICE GT'!B15),\"\",IF('PODEŠAVANJA-NE BRISATI'!$D$14>16,'[1]PRIPREMA DEVOJCICE GT'!A15,\"\"))","v":""},null,{"$f":"IF(OR(ISNUMBER('[1]PRIPREMA DEVOJCICE KV'!H15),ISTEXT('[1]PRIPREMA DEVOJCICE KV'!H15)),'[1]PRIPREMA DEVOJCICE KV'!A15,\"\")","v":8}]
[null,null,null,null,null,null,null,null,null,null,null,null,null,null,null,null,null,null,null,null,null,null,null,null,null,null,null,null,null,null,null,null,null,null,null,null,null,null,null,null,null,null,null,null,null,null,null,null,null,null,null,null,{"$f":"MID(F13,4,2)","v":"4"},null,128,null,"32>8",null,null,null,null,null,"15","15m","15z","15mq","15zq","15md","15zd",null,null,null,{"$f":"IF(ISBLANK('[1]PRIPREMA DECACI GT'!B16),\"\",IF('PODEŠAVANJA-NE BRISATI'!$D$13>32,'[1]PRIPREMA DECACI GT'!A16,\"\"))","v":9},null,{"$f":"IF(AND('PODEŠAVANJA-NE BRISATI'!$BA$15=\"8\",ISNUMBER('[1]PRIPREMA DECACI KV'!H16)),'[1]PRIPREMA DECACI KV'!A16,\"\")","v":""},null,{"$f":"IF(ISBLANK('[1]PRIPREMA DEVOJCICE GT'!B16),\"\",IF('PODEŠAVANJA-NE BRISATI'!$D$14>32,'[1]PRIPREMA DEVOJCICE GT'!A16,\"\"))","v":""},null,{"$f":"IF(AND('PODEŠAVANJA-NE BRISATI'!$BA$16=\"8\",ISNUMBER('[1]PRIPREMA DEVOJCICE KV'!H16)),'[1]PRIPREMA DEVOJCICE KV'!A16,\"\")","v":""}]
[null,null,null,null,null,null,null,null,null,null,null,null,null,null,null,null,null,null,null,null,null,null,null,null,null,null,null,null,null,null,null,null,null,null,null,null,null,null,null,null,null,null,null,null,null,null,null,null,null,null,null,null,{"$f":"MID(F14,4,2)","v":""},null,null,null,null,null,null,"Upis:",null,null,"16","16m","16z","16mq","16zq","16md","16zd",null,null,null,{"$f":"IF(ISBLANK('[1]PRIPREMA DECACI GT'!B17),\"\",IF('PODEŠAVANJA-NE BRISATI'!$D$13>32,'[1]PRIPREMA DECACI GT'!A17,\"\"))","v":10},null,{"$f":"IF(AND('PODEŠAVANJA-NE BRISATI'!$BA$15=\"8\",ISNUMBER('[1]PRIPREMA DECACI KV'!H17)),'[1]PRIPREMA DECACI KV'!A17,\"\")","v":""},null,{"$f":"IF(ISBLANK('[1]PRIPREMA DEVOJCICE GT'!B17),\"\",IF('PODEŠAVANJA-NE BRISATI'!$D$14>32,'[1]PRIPREMA DEVOJCICE GT'!A17,\"\"))","v":""},null,{"$f":"IF(AND('PODEŠAVANJA-NE BRISATI'!$BA$16=\"8\",ISNUMBER('[1]PRIPREMA DEVOJCICE KV'!H17)),'[1]PRIPREMA DEVOJCICE KV'!A17,\"\")","v":""}]
[null,null,null,null,null,null,null,null,null,null,null,null,null,null,null,null,null,null,null,null,null,null,null,null,null,null,null,null,null,null,null,null,null,null,null,null,null,null,null,null,null,null,null,null,null,null,null,null,null,null,null,null,null,null,null,null,null,null,null,"Upis LL do:",null,null,"17","17m","17z","17mq","17zq","17md","17zd",null,null,null,{"$f":"IF(ISBLANK('[1]PRIPREMA DECACI GT'!B18),\"\",IF('PODEŠAVANJA-NE BRISATI'!$D$13>32,'[1]PRIPREMA DECACI GT'!A18,\"\"))","v":11},null,{"$f":"IF(AND('PODEŠAVANJA-NE BRISATI'!$BA$15=\"8\",ISNUMBER('[1]PRIPREMA DECACI KV'!H18)),'[1]PRIPREMA DECACI KV'!A18,\"\")","v":""},null,{"$f":"IF(ISBLANK('[1]PRIPREMA DEVOJCICE GT'!B18),\"\",IF('PODEŠAVANJA-NE BRISATI'!$D$14>32,'[1]PRIPREMA DEVOJCICE GT'!A18,\"\"))","v":""},null,{"$f":"IF(AND('PODEŠAVANJA-NE BRISATI'!$BA$16=\"8\",ISNUMBER('[1]PRIPREMA DEVOJCICE KV'!H18)),'[1]PRIPREMA DEVOJCICE KV'!A18,\"\")","v":""}]
[null,null,null,null,null,null,null,null,null,null,null,null,null,null,null,null,null,null,null,null,null,null,null,null,null,null,null,null,null,null,null,null,null,null,null,null,null,null,null,null,null,null,null,null,null,null,null,null,null,null,null,null,null,null,null,null,null,null,null,"Upis ALT do:",null,null,"18","18m","18z","18mq","18zq","18md","18zd",null,null,null,{"$f":"IF(ISBLANK('[1]PRIPREMA DECACI GT'!B19),\"\",IF('PODEŠAVANJA-NE BRISATI'!$D$13>32,'[1]PRIPREMA DECACI GT'!A19,\"\"))","v":12},null,{"$f":"IF(AND('PODEŠAVANJA-NE BRISATI'!$BA$15=\"8\",ISNUMBER('[1]PRIPREMA DECACI KV'!H19)),'[1]PRIPREMA DECACI KV'!A19,\"\")","v":""},null,{"$f":"IF(ISBLANK('[1]PRIPREMA DEVOJCICE GT'!B19),\"\",IF('PODEŠAVANJA-NE BRISATI'!$D$14>32,'[1]PRIPREMA DEVOJCICE GT'!A19,\"\"))","v":""},null,{"$f":"IF(AND('PODEŠAVANJA-NE BRISATI'!$BA$16=\"8\",ISNUMBER('[1]PRIPREMA DEVOJCICE KV'!H19)),'[1]PRIPREMA DEVOJCICE KV'!A19,\"\")","v":""}]
[null,null,null,null,null,null,null,null,null,null,null,null,null,null,null,null,null,null,null,null,null,null,null,null,null,null,null,null,null,null,null,null,null,null,null,null,null,null,null,null,null,null,null,null,null,null,null,null,null,null,null,null,null,null,null,null,null,null,null,null,null,null,"19","19m","19z","19mq","19zq","19md","19zd",null,null,null,{"$f":"IF(ISBLANK('[1]PRIPREMA DECACI GT'!B20),\"\",IF('PODEŠAVANJA-NE BRISATI'!$D$13>32,'[1]PRIPREMA DECACI GT'!A20,\"\"))","v":13},null,{"$f":"IF(AND('PODEŠAVANJA-NE BRISATI'!$BA$15=\"8\",ISNUMBER('[1]PRIPREMA DECACI KV'!H20)),'[1]PRIPREMA DECACI KV'!A20,\"\")","v":""},null,{"$f":"IF(ISBLANK('[1]PRIPREMA DEVOJCICE GT'!B20),\"\",IF('PODEŠAVANJA-NE BRISATI'!$D$14>32,'[1]PRIPREMA DEVOJCICE GT'!A20,\"\"))","v":""},null,{"$f":"IF(AND('PODEŠAVANJA-NE BRISATI'!$BA$16=\"8\",ISNUMBER('[1]PRIPREMA DEVOJCICE KV'!H20)),'[1]PRIPREMA DEVOJCICE KV'!A20,\"\")","v":""}]
[null,null,null,null,null,null,null,null,null,null,null,null,null,null,null,null,null,null,null,null,null,null,null,null,null,null,null,null,null,null,null,null,null,null,null,null,null,null,null,null,null,null,null,null,null,null,null,null,null,null,null,null,null,null,null,null,null,null,null,null,null,null,"20","20m","20z","20mq","20zq","20md","20zd",null,null,null,{"$f":"IF(ISBLANK('[1]PRIPREMA DECACI GT'!B21),\"\",IF('PODEŠAVANJA-NE BRISATI'!$D$13>32,'[1]PRIPREMA DECACI GT'!A21,\"\"))","v":14},null,{"$f":"IF(AND('PODEŠAVANJA-NE BRISATI'!$BA$15=\"8\",ISNUMBER('[1]PRIPREMA DECACI KV'!H21)),'[1]PRIPREMA DECACI KV'!A21,\"\")","v":""},null,{"$f":"IF(ISBLANK('[1]PRIPREMA DEVOJCICE GT'!B21),\"\",IF('PODEŠAVANJA-NE BRISATI'!$D$14>32,'[1]PRIPREMA DEVOJCICE GT'!A21,\"\"))","v":""},null,{"$f":"IF(AND('PODEŠAVANJA-NE BRISATI'!$BA$16=\"8\",ISNUMBER('[1]PRIPREMA DEVOJCICE KV'!H21)),'[1]PRIPREMA DEVOJCICE KV'!A21,\"\")","v":""}]
[null,null,null,null,null,null,null,null,null,null,null,null,null,null,null,null,null,null,null,null,null,null,null,null,null,null,null,null,null,null,null,null,null,null,null,null,null,null,null,null,null,null,null,null,null,null,null,null,null,null,null,null,null,null,null,null,null,null,null,null,null,null,"21","21m","21z","21mq","21zq","21md","21zd",null,null,null,{"$f":"IF(ISBLANK('[1]PRIPREMA DECACI GT'!B22),\"\",IF('PODEŠAVANJA-NE BRISATI'!$D$13>32,'[1]PRIPREMA DECACI GT'!A22,\"\"))","v":15},null,{"$f":"IF(AND('PODEŠAVANJA-NE BRISATI'!$BA$15=\"8\",ISNUMBER('[1]PRIPREMA DECACI KV'!H22)),'[1]PRIPREMA DECACI KV'!A22,\"\")","v":""},null,{"$f":"IF(ISBLANK('[1]PRIPREMA DEVOJCICE GT'!B22),\"\",IF('PODEŠAVANJA-NE BRISATI'!$D$14>32,'[1]PRIPREMA DEVOJCICE GT'!A22,\"\"))","v":""},null,{"$f":"IF(AND('PODEŠAVANJA-NE BRISATI'!$BA$16=\"8\",ISNUMBER('[1]PRIPREMA DEVOJCICE KV'!H22)),'[1]PRIPREMA DEVOJCICE KV'!A22,\"\")","v":""}]
[null,null,null,null,null,null,null,null,null,null,null,null,null,null,null,null,null,null,null,null,null,null,null,null,null,null,null,null,null,null,null,null,null,null,null,null,null,null,null,null,null,null,null,null,null,null,null,null,null,null,null,null,"RASPORED ",null,null,null,null,null,null,null,null,null,"22","22m","22z","22mq","22zq","22md","22zd",null,null,null,{"$f":"IF(ISBLANK('[1]PRIPREMA DECACI GT'!B23),\"\",IF('PODEŠAVANJA-NE BRISATI'!$D$13>32,'[1]PRIPREMA DECACI GT'!A23,\"\"))","v":16},null,{"$f":"IF(AND('PODEŠAVANJA-NE BRISATI'!$BA$15=\"8\",ISNUMBER('[1]PRIPREMA DECACI KV'!H23)),'[1]PRIPREMA DECACI KV'!A23,\"\")","v":""},null,{"$f":"IF(ISBLANK('[1]PRIPREMA DEVOJCICE GT'!B23),\"\",IF('PODEŠAVANJA-NE BRISATI'!$D$14>32,'[1]PRIPREMA DEVOJCICE GT'!A23,\"\"))","v":""},null,{"$f":"IF(AND('PODEŠAVANJA-NE BRISATI'!$BA$16=\"8\",ISNUMBER('[1]PRIPREMA DEVOJCICE KV'!H23)),'[1]PRIPREMA DEVOJCICE KV'!A23,\"\")","v":""}]
[null,null,null,null,null,null,null,null,null,null,null,null,null,null,null,null,null,null,null,null,null,null,null,null,null,null,null,null,null,null,null,null,null,null,null,null,null,null,null,null,null,null,null,null,null,null,null,null,null,null,null,null,"MUSKARCI","ZENE",null,null,null,null,null,null,null,null,"23","23m","23z","23mq","23zq","23md","23zd"]
["UPISNE LISTE","PRIPREMNE LISTE","ŽREBOVI",null,null,null,null,null,null,null,null,null,"RASPORED",null,null,null,null,null,null,null,null,null,null,null,null,null,null,null,null,null,null,null,null,null,null,null,null,null,null,null,null,null,null,null,null,null,null,null,null,null,null,null,"1. KOLO MS","1. KOLO ŽS",null,null,null,null,null,null,null,null,"24","24m","24z","24mq","24zq","24md","24zd"]
[null,null,"GLAVNI",null,null,null,"KVALIFIKACIJE",null,null,"DUBL",null,null,1,2,3,4,5,6,7,8,9,10,null,null,null,null,null,null,null,null,null,null,null,null,null,null,null,null,null,null,null,null,null,null,null,null,null,null,null,null,null,null,"2. KOLO MS","2. KOLO ŽS",null,null,null,null,null,null,null,null,"25","25m","25z","25mq","25zq","25md","25zd"]
[null,null,null,null,null,null,null,null,null,null,null,null,null,null,null,null,null,null,null,null,null,null,null,null,null,null,null,null,null,null,null,null,null,null,null,null,null,null,null,null,null,null,null,null,null,null,null,null,null,null,null,null,"3. KOLO MS","3. KOLO ŽS",null,null,"kategorija",null,null,null,null,null,"26","26m","26z","26mq","26zq","26md","26zd"]
[null,null,null,null,null,null,null,null,null,null,null,null,null,null,null,null,null,null,null,null,null,null,null,null,null,null,null,null,null,null,null,null,null,null,null,null,null,null,null,null,null,null,null,null,null,null,null,null,null,null,null,null,"1/4 FINALE MS","1/4 FINALE ŽS",null,null,"A",null,null,null,null,null,"27","27m","27z","27mq","27zq","27md","27zd"]
[null,null,null,null,null,null,null,null,null,null,null,null,null,null,null,null,null,null,null,null,null,null,null,null,null,null,null,null,null,null,null,null,null,null,null,null,null,null,null,null,null,null,null,null,null,null,null,null,null,null,null,null,"1/2 FINALE MS","1/2 FINALE ŽS",null,null,"B",null,null,null,null,null,"28","28m","28z","28mq","28zq","28md","28zd"]
[null,null,null,null,null,null,null,null,null,null,null,null,null,null,null,null,null,null,null,null,null,null,null,null,null,null,null,null,null,null,null,null,null,null,null,null,null,null,null,null,null,null,null,null,null,null,null,null,null,null,null,null,"FINALE MS","FINALE ŽS",null,null,"E",null,null,null,null,null,"29","29m","29z","29mq","29zq","29md","29zd"]
[null,null,null,null,null,null,null,null,null,null,null,null,null,null,null,null,null,null,null,null,null,null,null,null,null,null,null,null,null,null,null,null,null,null,null,null,null,null,null,null,null,null,null,null,null,null,null,null,null,null,null,null,null,null,null,null,"l",null,null,null,null,null,"30","30m","30z","30mq","30zq","30md","30zd"]
[null,null,null,null,null,null,null,null,null,null,null,null,null,null,null,null,null,null,null,null,null,null,null,null,null,null,null,null,null,null,null,null,null,null,null,null,null,null,null,null,null,null,null,null,null,null,null,null,null,null,null,null,"1. KOLO MSQ","1. KOLO ŽSQ",null,null,"ll",null,null,null,null,null,"31","31m","31z","31mq","31zq","31md","31zd"]
[null,null,null,null,null,null,null,null,null,null,null,null,null,null,null,null,null,null,null,null,null,null,null,null,null,null,null,null,null,null,null,null,null,null,null,null,null,null,null,null,null,null,null,null,null,null,null,null,null,null,null,null,"2. KOLO MSQ","2. KOLO ŽSQ",null,null,"lll",null,null,null,null,null,"32","32m","32z","32mq","32zq","32md","32zd"]
[null,null,null,null,null,null,null,null,null,null,null,null,null,null,null,null,null,null,null,null,null,null,null,null,null,null,null,null,null,null,null,null,null,null,null,null,null,null,null,null,null,null,null,null,null,null,null,null,null,null,null,null,"ODLUČUJUĆE KOLO MSQ","ODLUČUJUĆE KOLO ŽSQ",null,null,null,null,null,null,null,null,"33","33m","33z","33mq","33zq","33md","33zd"]
[null,null,null,null,null,null,null,null,null,null,null,null,null,null,null,null,null,null,null,null,null,null,null,null,null,null,null,null,null,null,null,null,null,null,null,null,null,null,null,null,null,null,null,null,null,null,null,null,null,null,null,null,null,null,null,null,null,null,null,null,null,null,"34","34m","34z","34mq","34zq","34md","34zd"]
[null,null,null,null,null,null,null,null,null,null,null,null,null,null,null,null,null,null,null,null,null,null,null,null,null,null,null,null,null,null,null,null,null,null,null,null,null,null,null,null,null,null,null,null,null,null,null,null,null,null,null,null,"1. KOLO MD","1. KOLO ŽD",null,null,null,null,null,null,null,null,"35","35m","35z","35mq","35zq","35md","35zd"]
[null,null,null,null,null,null,null,null,null,null,null,null,null,null,null,null,null,null,null,null,null,null,null,null,null,null,null,null,null,null,null,null,null,null,null,null,null,null,null,null,null,null,null,null,null,null,null,null,null,null,null,null,"1/4 FINALE MD","1/4 FINALE ŽD",null,null,null,null,null,null,null,null,"36","36m","36z","36mq","36zq","36md","36zd"]
[null,null,null,null,null,null,null,null,null,null,null,null,null,null,null,null,null,null,null,null,null,null,null,null,null,null,null,null,null,null,null,null,null,null,null,null,null,null,null,null,null,null,null,null,null,null,null,null,null,null,null,null,"1/2 FINALE MD","1/2 FINALE ŽD",null,null,null,null,null,null,null,null,"37","37m","37z","37mq","37zq","37md","37zd"]
["OSTALO",null,null,null,null,null,null,null,null,null,null,null,null,null,null,null,null,null,null,null,null,null,null,null,null,null,null,null,null,null,null,null,null,null,null,null,null,null,null,null,null,null,null,null,null,null,null,null,null,null,null,null,"FINALE MD","FINALE ŽD",null,null,null,null,null,null,null,null,"38","38m","38z","38mq","38zq","38md","38zd"]
[null,null,null,null,null,null,null,null,null,null,null,null,null,null,null,null,null,null,null,null,null,null,null,null,null,null,null,null,null,null,null,null,null,null,null,null,null,null,null,null,null,null,null,null,null,null,null,null,null,null,null,null,null,null,null,null,null,null,null,null,null,null,"39","39m","39z","39mq","39zq","39md","39zd"]
[null,null,null,null,null,null,null,null,null,null,null,null,null,null,null,null,null,null,null,null,null,null,null,null,null,null,null,null,null,null,null,null,null,null,null,null,null,null,null,null,null,null,null,null,null,null,null,null,null,null,null,null,null,null,null,null,null,null,null,null,null,null,"40","40m","40z","40mq","40zq","40md","40zd"]
[null,null,null,null,null,null,null,null,null,null,null,null,null,null,null,null,null,null,null,null,null,null,null,null,null,null,null,null,null,null,null,null,null,null,null,null,null,null,null,null,null,null,null,null,null,null,null,null,null,null,null,null,null,null,null,null,null,null,null,null,null,null,"41","41m","41z","41mq","41zq","41md","41zd"]
[null,null,null,null,null,null,null,null,null,null,null,null,null,null,null,null,null,null,null,null,null,null,null,null,null,null,null,null,null,null,null,null,null,null,null,null,null,null,null,null,null,null,null,null,null,null,null,null,null,null,null,null,null,null,null,null,null,null,null,null,null,null,"42","42m","42z","42mq","42zq","42md","42zd"]
[null,null,null,null,null,null,null,null,null,null,null,null,null,null,null,null,null,null,null,null,null,null,null,null,null,null,null,null,null,null,null,null,null,null,null,null,null,null,null,null,null,null,null,null,null,null,null,null,null,null,null,null,null,null,null,null,null,null,null,null,null,null,"43","43m","43z","43mq","43zq","43md","43zd"]
[null,null,null,null,null,null,null,null,null,null,null,null,null,null,null,null,null,null,null,null,null,null,null,null,null,null,null,null,null,null,null,null,null,null,null,null,null,null,null,null,null,null,null,null,null,null,null,null,null,null,null,null,null,null,null,null,null,null,null,null,null,null,"44","44m","44z","44mq","44zq","44md","44zd"]
[null,null,null,null,null,null,null,null,null,null,null,null,null,null,null,null,null,null,null,null,null,null,null,null,null,null,null,null,null,null,null,null,null,null,null,null,null,null,null,null,null,null,null,null,null,null,null,null,null,null,null,null,null,null,null,null,null,null,null,null,null,null,"45","45m","45z","45mq","45zq","45md","45zd"]
[null,null,null,null,null,null,null,null,null,null,null,null,null,null,null,null,null,null,null,null,null,null,null,null,null,null,null,null,null,null,null,null,null,null,null,null,null,null,null,null,null,null,null,null,null,null,null,null,null,null,null,null,null,null,null,null,null,null,null,null,null,null,"46","46m","46z","46mq","46zq","46md","46zd"]
[null,null,null,null,null,null,null,null,null,null,null,null,null,null,null,null,null,null,null,null,null,null,null,null,null,null,null,null,null,null,null,null,null,null,null,null,null,null,null,null,null,null,null,null,null,null,null,null,null,null,null,null,null,null,null,null,null,null,null,null,null,null,"47","47m","47z","47mq","47zq","47md","47zd"]
[null,null,null,null,null,null,null,null,null,null,null,null,null,null,null,null,null,null,null,null,null,null,null,null,null,null,null,null,null,null,null,null,null,null,null,null,null,null,null,null,null,null,null,null,null,null,null,null,null,null,null,null,null,null,null,null,null,null,null,null,null,null,"48","48m","48z","48mq","48zq","48md","48zd"]
[null,null,null,null,null,null,null,null,null,null,null,null,null,null,null,null,null,null,null,null,null,null,null,null,null,null,null,null,null,null,null,null,null,null,null,null,null,null,null,null,null,null,null,null,null,null,null,null,null,null,null,null,null,null,null,null,null,null,null,null,null,null,"49","49m","49z","49mq","49zq","49md","49zd"]
[null,null,null,null,null,null,null,null,null,null,null,null,null,null,null,null,null,null,null,null,null,null,null,null,null,null,null,null,null,null,null,null,null,null,null,null,null,null,null,null,null,null,null,null,null,null,null,null,null,null,null,null,null,null,null,null,null,null,null,null,null,null,"50","50m","50z","50mq","50zq","50md","50zd"]
[null,null,null,null,null,null,null,null,null,null,null,null,null,null,null,null,null,null,null,null,null,null,null,null,null,null,null,null,null,null,null,null,null,null,null,null,null,null,null,null,null,null,null,null,null,null,null,null,null,null,null,null,null,null,null,null,null,null,null,null,null,null,"51","51m","51z","51mq","51zq","51md","51zd"]
[null,null,null,null,null,null,null,null,null,null,null,null,null,null,null,null,null,null,null,null,null,null,null,null,null,null,null,null,null,null,null,null,null,null,null,null,null,null,null,null,null,null,null,null,null,null,null,null,null,null,null,null,null,null,null,null,null,null,null,null,null,null,"52","52m","52z","52mq","52zq","52md","52zd"]
[null,null,null,null,null,null,null,null,null,null,null,null,null,null,null,null,null,null,null,null,null,null,null,null,null,null,null,null,null,null,null,null,null,null,null,null,null,null,null,null,null,null,null,null,null,null,null,null,null,null,null,null,null,null,null,null,null,null,null,null,null,null,"53","53m","53z","53mq","53zq","53md","53zd"]
[null,null,null,null,null,null,null,null,null,null,null,null,null,null,null,null,null,null,null,null,null,null,null,null,null,null,null,null,null,null,null,null,null,null,null,null,null,null,null,null,null,null,null,null,null,null,null,null,null,null,null,null,null,null,null,null,null,null,null,null,null,null,"54","54m","54z","54mq","54zq","54md","54zd"]
[null,null,null,null,null,null,null,null,null,null,null,null,null,null,null,null,null,null,null,null,null,null,null,null,null,null,null,null,null,null,null,null,null,null,null,null,null,null,null,null,null,null,null,null,null,null,null,null,null,null,null,null,null,null,null,null,null,null,null,null,null,null,"55","55m","55z","55mq","55zq","55md","55zd"]
[null,null,null,null,null,null,null,null,null,null,null,null,null,null,null,null,null,null,null,null,null,null,null,null,null,null,null,null,null,null,null,null,null,null,null,null,null,null,null,null,null,null,null,null,null,null,null,null,null,null,null,null,null,null,null,null,null,null,null,null,null,null,"56","56m","56z","56mq","56zq","56md","56zd"]
[null,null,null,null,null,null,null,null,null,null,null,null,null,null,null,null,null,null,null,null,null,null,null,null,null,null,null,null,null,null,null,null,null,null,null,null,null,null,null,null,null,null,null,null,null,null,null,null,null,null,null,null,null,null,null,null,null,null,null,null,null,null,"57","57m","57z","57mq","57zq","57md","57zd"]
[null,null,null,null,null,null,null,null,null,null,null,null,null,null,null,null,null,null,null,null,null,null,null,null,null,null,null,null,null,null,null,null,null,null,null,null,null,null,null,null,null,null,null,null,null,null,null,null,null,null,null,null,null,null,null,null,null,null,null,null,null,null,"58","58m","58z","58mq","58zq","58md","58zd"]
[null,null,null,null,null,null,null,null,null,null,null,null,null,null,null,null,null,null,null,null,null,null,null,null,null,null,null,null,null,null,null,null,null,null,null,null,null,null,null,null,null,null,null,null,null,null,null,null,null,null,null,null,null,null,null,null,null,null,null,null,null,null,"59","59m","59z","59mq","59zq","59md","59zd"]
[null,null,null,null,null,null,null,null,null,null,null,null,null,null,null,null,null,null,null,null,null,null,null,null,null,null,null,null,null,null,null,null,null,null,null,null,null,null,null,null,null,null,null,null,null,null,null,null,null,null,null,null,null,null,null,null,null,null,null,null,null,null,"60","60m","60z","60mq","60zq","60md","60zd"]
[null,null,null,null,null,null,null,null,null,null,null,null,null,null,null,null,null,null,null,null,null,null,null,null,null,null,null,null,null,null,null,null,null,null,null,null,null,null,null,null,null,null,null,null,null,null,null,null,null,null,null,null,null,null,null,null,null,null,null,null,null,null,"61","61m","61z","61mq","61zq","61md","61zd"]
[null,null,null,null,null,null,null,null,null,null,null,null,null,null,null,null,null,null,null,null,null,null,null,null,null,null,null,null,null,null,null,null,null,null,null,null,null,null,null,null,null,null,null,null,null,null,null,null,null,null,null,null,null,null,null,null,null,null,null,null,null,null,"62","62m","62z","62mq","62zq","62md","62zd"]
[null,null,null,null,null,null,null,null,null,null,null,null,null,null,null,null,null,null,null,null,null,null,null,null,null,null,null,null,null,null,null,null,null,null,null,null,null,null,null,null,null,null,null,null,null,null,null,null,null,null,null,null,null,null,null,null,null,null,null,null,null,null,"63","63m","63z","63mq","63zq","63md","63zd"]

{"sheet":"PODESAVANJE","index":1,"n_rows":0,"n_cols":0,"rows_kept":0,"cut":false,"hidden":true,"merged":[]}

{"sheet":"UPIS DECACI GT","index":2,"n_rows":207,"n_cols":18,"rows_kept":207,"cut":false,"hidden":true,"merged":[[0,3,0,6],[3,0,3,1]]}
[{"$f":"'[1]PODEŠAVANJA-NE BRISATI'!$A$6","v":"OP BEOGRADA"}]
[{"$f":"'[1]PODEŠAVANJA-NE BRISATI'!$A$8","v":"Teniski savez Srbije"}]
["DATUM",null,"GRAD, KLUB",null,null,"KATEGORIJA","KONKURENCIJA",null,null,"VRHOVNI SUDIJA","POTPIS VRHOVNOG SUDIJE"]
[]
[null,null,"DAN","DATUM",null,"VREME","MESTO"]
["KRAJNJI ROK ZA UPIS:"]
["BROJ","PREZIME","IME","KLUB","DATUM RODJENJA","POTPIS IGRACA","TAKMICARSKA LEGITIMACIJA",null,null,null,null,null,null,null,null,"RANG","STATUS","NOSIOC"]
[1]
[2]
[3]
[4]
[5]
[6]
[7]
[8]
[9]
[10]
[11]
[12]
[13]
[14]
[15]
[16]
[17]
[18]
[19]
[20]
[21]
[22]
[23]
[24]
[25]
[26]
[27]
[28]
[29]
[30]
[31]
[32]
[33]
[34]
[35]
[36]
[37]
[38]
[39]
[40]
[41]
[42]
[43]
[44]
[45]
[46]
[47]
[48]
[49]
[50]
[51]
[52]
[53]
[54]
[55]
[56]
[57]
[58]
[59]
[60]
[61]
[62]
[63]
[64]
[65]
[66]
[67]
[68]
[69]
[70]
[71]
[72]
[73]
[74]
[75]
[76]
[77]
[78]
[79]
[80]
[81]
[82]
[83]
[84]
[85]
[86]
[87]
[88]
[89]
[90]
[91]
[92]
[93]
[94]
[95]
[96]
[97]
[98]
[99]
[100]
[101]
[102]
[103]
[104]
[105]
[106]
[107]
[108]
[109]
[110]
[111]
[112]
[113]
[114]
[115]
[116]
[117]
[118]
[119]
[120]
[121]
[122]
[123]
[124]
[125]
[126]
[127]
[128]
[129]
[130]
[131]
[132]
[133]
[134]
[135]
[136]
[137]
[138]
[139]
[140]
[141]
[142]
[143]
[144]
[145]
[146]
[147]
[148]
[149]
[150]
[151]
[152]
[153]
[154]
[155]
[156]
[157]
[158]
[159]
[160]
[161]
[162]
[163]
[164]
[165]
[166]
[167]
[168]
[169]
[170]
[171]
[172]
[173]
[174]
[175]
[176]
[177]
[178]
[179]
[180]
[181]
[182]
[183]
[184]
[185]
[186]
[187]
[188]
[189]
[190]
[191]
[192]
[193]
[194]
[195]
[196]
[197]
[198]
[199]
[200]

{"sheet":"PRIPREMA ","index":3,"n_rows":136,"n_cols":30,"rows_kept":136,"cut":false,"hidden":false,"merged":[[4,0,4,1]]}
[]
[]
[null,null,null,null,null,null,null,null,null,null,null,null,null,null,null,null,null,null,null,"Over 18",{"$f":"YEAR($A$5)-18","v":1882}]
[null,null,null,null,null,null,null,null,null,null,null,null,null,null,null,null,null,null,null,"Under 13",{"$f":"YEAR($A$5)-13","v":1887}]
[null,null,null,null,null,null,{"$f":"'[2]PODEŠAVANJA-NE BRISATI'!$A$12","v":0}]
["BROJ","PREZIME","IME","KLUB","Date of Birth\ndd mmm yy","TAKMIČARSKA",null,"RANG",null,null,null,null,"Seed Sort",null,null,"RANG NOSIOCA","AccSort","POZICIJA NOSIOCA",null,null,null,null,null,null,null,null,null,null,"II","III"]
["B","BYE",null,null,null,null,null,0,null,null,null,null,null,null,null,0,null,null,null,null,null,{"$f":"B8&\" \"&C8","v":"Ristic Ognjen"},{"$f":"IF(AND(OR($D$5=4,$D$5=\"IV\",$D$5=\"IV\"),H7>0,H7<21,$G$5<>\"sen\"),\"NE MOZE DA IGRA!!!\",IF(AND(OR($D$5=3,$D$5=\"lll\",$D$5=\"III\"),H7>0,H7<11,$G$5<>\"sen\"),\"NE MOZE DA IGRA!!!\",\"\"))","v":""},null,{"$f":"IF(ISNUMBER(H7),H7,MID(AB7,5,5))","v":0},{"$f":"IF(AB7=\"tss\",Y7+10000,Y7)","v":10000},null,{"$f":"IF(ISNUMBER(H7),\"tss\",H7)","v":"tss"}]
[1,"Ristic","Ognjen","SLA","21.8.2009",17926,null,39,null,null,null,null,null,null,"DA",39,null,1,null,null,null,{"$f":"B8&\" \"&C8","v":"Ristic Ognjen"},{"$f":"IF(OR(ISBLANK(H8),H8=0),\"\",IF(AND($D$5=\"lll\",$G$5<>\"sen\"),AD8,IF(AND($D$5=\"ll\",$G$5<>\"sen\"),AC8,\"\")))","v":""},null,{"$f":"IF(OR(H8=0,ISBLANK(H8)),1000+A8,IF(ISNUMBER(H8),H8,MID(H8,4,5)))","v":39},{"$f":"IF(AB8=\"tss\",Y8+100000,IF(AB8=\"te\",Y8+50000,IF(AB8=\"itf\",Y8+10000,Y8)))","v":100039},null,{"$f":"IF(ISNUMBER(H8),\"tss\",LEFT(H8,FIND(\" \",H8)-1))","v":"tss"},{"$f":"IF(AB8=\"atp\",\"NE MOŽE DA IGRA!!!\",IF(AND(AB8=\"itf\",Z8<10201),\"NE MOŽE DA IGRA!!!\",IF(AND(AB8=\"TE\",Z8<50201),\"NE MOŽE DA IGRA!!!\",IF(AND(AB8=\"TSS\",Z8<100011),\"NE MOŽE DA IGRA!!!\",\"\"))))","v":""},{"$f":"IF(AB8=\"atp\",\"NE MOŽE DA IGRA!!!\",IF(AND(AB8=\"itf\",Z8<10201),\"NE MOŽE DA IGRA!!!\",IF(AND(AB8=\"TE\",Z8<50201),\"NE MOŽE DA IGRA!!!\",IF(AND(AB8=\"TSS\",Z8<100021),\"NE MOŽE DA IGRA!!!\",\"\"))))","v":""}]
[2,"Mladenovic","Janko","AST","7.4.2009",17265,null,56,null,null,null,null,null,null,"DA",56,null,2,null,null,null,"Mladenovic Janko","",null,56,100056,null,"tss","",""]
[3,"Aleksic","Jovan","TOP","13.10.2010",17586,null,69,null,null,null,null,null,null,"DA",69,null,4,null,null,null,"Aleksic Jovan","",null,69,100069,null,"tss","",""]
[4,"Djordjevic ","Veljko","AST","14.5.2009",16611,null,78,null,null,null,null,null,null,"DA",78,null,5,null,null,null,"Djordjevic  Veljko","",null,78,100078,null,"tss","",""]
[5,"Stanimirovic","Rastko","SLA","20.1.2010",20017,null,108,null,null,null,null,null,null,"DA",108,null,6,null,null,null,"Stanimirovic Rastko","",null,108,100108,null,"tss","",""]
[6,"Milic","Milos","SLA",null,12870,null,null,null,null,null,null,null,null,"DA",{"$f":"H13","v":0},null,null,null,null,null,"Milic Milos","",null,1006,{"$error":"#VALUE!"},null,{"$error":"#VALUE!"},{"$error":"#VALUE!"},{"$error":"#VALUE!"}]
[7,"Ognjanovic","Sava","TOP",null,21881,null,null,null,null,null,null,null,null,"DA",0,null,null,null,null,null,"Ognjanovic Sava","",null,1007,{"$error":"#VALUE!"},null,{"$error":"#VALUE!"},{"$error":"#VALUE!"},{"$error":"#VALUE!"}]
[8,"Stanimirovic","Vukan","SLA",null,20014,null,null,null,null,null,null,null,null,"DA",0,null,null,null,null,null,"Stanimirovic Vukan","",null,1008,{"$error":"#VALUE!"},null,{"$error":"#VALUE!"},{"$error":"#VALUE!"},{"$error":"#VALUE!"}]
[9,"Stepanovic","Novak","AST",null,21893,null,null,null,null,null,null,null,null,"DA",0,null,null,null,null,null,"Stepanovic Novak","",null,1009,{"$error":"#VALUE!"},null,{"$error":"#VALUE!"},{"$error":"#VALUE!"},{"$error":"#VALUE!"}]
[10,"Vujcic","Veljko","SLA",null,20138,null,null,null,null,null,null,null,null,"DA",null,null,null,null,null,null,null,null,null,1010]
[11,"Jovanovic","Filip","TAZ","6.9.2010",20009,null,67,null,null,null,null,null,null,"OSA",67,null,3,null,null,null,"Jovanovic Filip","",null,67,100067,null,"tss","",""]
[11,null,null,null,null,null,null,null,null,null,null,null,null,null,null,0,null,null,null,null,null," ","",null,1011,{"$error":"#VALUE!"},null,{"$error":"#VALUE!"},{"$error":"#VALUE!"},{"$error":"#VALUE!"}]
[12,null,null,null,null,null,null,null,null,null,null,null,null,null,null,0,null,null,null,null,null," ","",null,1012,{"$error":"#VALUE!"},null,{"$error":"#VALUE!"},{"$error":"#VALUE!"},{"$error":"#VALUE!"}]
[13,null,null,null,null,null,null,null,null,null,null,null,null,null,null,0,null,null,null,null,null," ","",null,1013,{"$error":"#VALUE!"},null,{"$error":"#VALUE!"},{"$error":"#VALUE!"},{"$error":"#VALUE!"}]
[14,null,null,null,null,null,null,null,null,null,null,null,null,null,null,0,null,null,null,null,null," ","",null,1014,{"$error":"#VALUE!"},null,{"$error":"#VALUE!"},{"$error":"#VALUE!"},{"$error":"#VALUE!"}]
[15,null,null,null,null,null,null,null,null,null,null,null,null,null,null,0,null,null,null,null,null," ","",null,1015,{"$error":"#VALUE!"},null,{"$error":"#VALUE!"},{"$error":"#VALUE!"},{"$error":"#VALUE!"}]
[16,null,null,null,null,null,null,null,null,null,null,null,null,null,null,0,null,null,null,null,null," ",null,null,1016,{"$error":"#VALUE!"},null,{"$error":"#VALUE!"},{"$error":"#VALUE!"},{"$error":"#VALUE!"}]
[17,null,null,null,null,null,null,null,null,null,null,null,null,null,null,0,null,null,null,null,null," ",null,null,1017,{"$error":"#VALUE!"},null,{"$error":"#VALUE!"},{"$error":"#VALUE!"},{"$error":"#VALUE!"}]
[18,null,null,null,null,null,null,null,null,null,null,null,null,null,null,0,null,null,null,null,null," ",{"$f":"IF(OR(ISBLANK(H26),H26=0),\"\",IF(AND($D$5=\"lll\",$G$5<>\"sen\"),AD26,IF(AND($D$5=\"ll\",$G$5<>\"sen\"),AC26,\"\")))","v":""},null,1018,{"$error":"#VALUE!"},null,{"$error":"#VALUE!"},{"$error":"#VALUE!"},{"$error":"#VALUE!"}]
[19,null,null,null,null,null,null,null,null,null,null,null,null,null,null,0,null,null,null,null,null," ","",null,1019,{"$error":"#VALUE!"},null,{"$error":"#VALUE!"},{"$error":"#VALUE!"},{"$error":"#VALUE!"}]
[20,null,null,null,null,null,null,null,null,null,null,null,null,null,null,0,null,null,null,null,null," ","",null,1020,{"$error":"#VALUE!"},null,{"$error":"#VALUE!"},{"$error":"#VALUE!"},{"$error":"#VALUE!"}]
[21,null,null,null,null,null,null,null,null,null,null,null,null,null,null,0,null,null,null,null,null," ","",null,1021,{"$error":"#VALUE!"},null,{"$error":"#VALUE!"},{"$error":"#VALUE!"},{"$error":"#VALUE!"}]
[22,null,null,null,null,null,null,null,null,null,null,null,null,null,null,0,null,null,null,null,null," ","",null,1022,{"$error":"#VALUE!"},null,{"$error":"#VALUE!"},{"$error":"#VALUE!"},{"$error":"#VALUE!"}]
[23,null,null,null,null,null,null,null,null,null,null,null,null,null,null,0,null,null,null,null,null," ","",null,1023,{"$error":"#VALUE!"},null,{"$error":"#VALUE!"},{"$error":"#VALUE!"},{"$error":"#VALUE!"}]
[24,null,null,null,null,null,null,null,null,null,null,null,null,null,null,0,null,null,null,null,null," ","",null,1024,{"$error":"#VALUE!"},null,{"$error":"#VALUE!"},{"$error":"#VALUE!"},{"$error":"#VALUE!"}]
[25,null,null,null,null,null,null,null,null,null,null,null,null,null,null,0,null,null,null,null,null," ","",null,1025,{"$error":"#VALUE!"},null,{"$error":"#VALUE!"},{"$error":"#VALUE!"},{"$error":"#VALUE!"}]
[26,null,null,null,null,null,null,null,null,null,null,null,null,null,null,0,null,null,null,null,null," ","",null,1026,{"$error":"#VALUE!"},null,{"$error":"#VALUE!"},{"$error":"#VALUE!"},{"$error":"#VALUE!"}]
[27,null,null,null,null,null,null,null,null,null,null,null,null,null,null,0,null,null,null,null,null," ","",null,1027,{"$error":"#VALUE!"},null,{"$error":"#VALUE!"},{"$error":"#VALUE!"},{"$error":"#VALUE!"}]
[28,null,null,null,null,null,null,null,null,null,null,null,null,null,null,0,null,null,null,null,null," ","",null,1028,{"$error":"#VALUE!"},null,{"$error":"#VALUE!"},{"$error":"#VALUE!"},{"$error":"#VALUE!"}]
[29,null,null,null,null,null,null,null,null,null,null,null,null,null,null,0,null,null,null,null,null," ","",null,1029,{"$error":"#VALUE!"},null,{"$error":"#VALUE!"},{"$error":"#VALUE!"},{"$error":"#VALUE!"}]
[30,null,null,null,null,null,null,null,null,null,null,null,null,null,null,0,null,null,null,null,null," ","",null,1030,{"$error":"#VALUE!"},null,{"$error":"#VALUE!"},{"$error":"#VALUE!"},{"$error":"#VALUE!"}]
[31,null,null,null,null,null,null,null,null,null,null,null,null,null,null,0,null,null,null,null,null," ","",null,1031,{"$error":"#VALUE!"},null,{"$error":"#VALUE!"},{"$error":"#VALUE!"},{"$error":"#VALUE!"}]
[32,null,null,null,null,null,null,null,null,null,null,null,null,null,null,0,null,null,null,null,null," ","",null,1032,{"$error":"#VALUE!"},null,{"$error":"#VALUE!"},{"$error":"#VALUE!"},{"$error":"#VALUE!"}]
[33,null,null,null,null,null,null,null,null,null,null,null,null,null,null,{"$f":"H41","v":0},null,null,null,null,null,{"$f":"B41&\" \"&C41","v":" "},"",null,{"$f":"IF(OR(H41=0,ISBLANK(H41)),1000+A41,IF(ISNUMBER(H41),H41,MID(H41,4,5)))","v":1033},{"$f":"IF(AB41=\"tss\",Y41+100000,IF(AB41=\"te\",Y41+50000,IF(AB41=\"itf\",Y41+10000,Y41)))","v":{"$error":"#VALUE!"}},null,{"$f":"IF(ISNUMBER(H41),\"tss\",LEFT(H41,FIND(\" \",H41)-1))","v":{"$error":"#VALUE!"}},{"$error":"#VALUE!"},{"$error":"#VALUE!"}]
[34,null,null,null,null,null,null,null,null,null,null,null,null,null,null,0,null,null,null,null,null," ","",null,1034,{"$error":"#VALUE!"},null,{"$error":"#VALUE!"},{"$error":"#VALUE!"},{"$error":"#VALUE!"}]
[35,null,null,null,null,null,null,null,null,null,null,null,null,null,null,0,null,null,null,null,null," ","",null,1035,{"$error":"#VALUE!"},null,{"$error":"#VALUE!"},{"$error":"#VALUE!"},{"$error":"#VALUE!"}]
[36,null,null,null,null,null,null,null,null,null,null,null,null,null,null,0,null,null,null,null,null," ","",null,1036,{"$error":"#VALUE!"},null,{"$error":"#VALUE!"},{"$error":"#VALUE!"},{"$error":"#VALUE!"}]
[37,null,null,null,null,null,null,null,null,null,null,null,null,null,null,0,null,null,null,null,null," ","",null,1037,{"$error":"#VALUE!"},null,{"$error":"#VALUE!"},{"$error":"#VALUE!"},{"$error":"#VALUE!"}]
[38,null,null,null,null,null,null,null,null,null,null,null,null,null,null,0,null,null,null,null,null," ","",null,1038,{"$error":"#VALUE!"},null,{"$error":"#VALUE!"},{"$error":"#VALUE!"},{"$error":"#VALUE!"}]
[39,null,null,null,null,null,null,null,null,null,null,null,null,null,null,0,null,null,null,null,null," ","",null,1039,{"$error":"#VALUE!"},null,{"$error":"#VALUE!"},{"$error":"#VALUE!"},{"$error":"#VALUE!"}]
[40,null,null,null,null,null,null,null,null,null,null,null,null,null,null,0,null,null,null,null,null," ","",null,1040,{"$error":"#VALUE!"},null,{"$error":"#VALUE!"},{"$error":"#VALUE!"},{"$error":"#VALUE!"}]
[41,null,null,null,null,null,null,null,null,null,null,null,null,null,null,0,null,null,null,null,null," ","",null,1041,{"$error":"#VALUE!"},null,{"$error":"#VALUE!"},{"$error":"#VALUE!"},{"$error":"#VALUE!"}]
[42,null,null,null,null,null,null,null,null,null,null,null,null,null,null,0,null,null,null,null,null," ","",null,1042,{"$error":"#VALUE!"},null,{"$error":"#VALUE!"},{"$error":"#VALUE!"},{"$error":"#VALUE!"}]
[43,null,null,null,null,null,null,null,null,null,null,null,null,null,null,0,null,null,null,null,null," ","",null,1043,{"$error":"#VALUE!"},null,{"$error":"#VALUE!"},{"$error":"#VALUE!"},{"$error":"#VALUE!"}]
[44,null,null,null,null,null,null,null,null,null,null,null,null,null,null,0,null,null,null,null,null," ","",null,1044,{"$error":"#VALUE!"},null,{"$error":"#VALUE!"},{"$error":"#VALUE!"},{"$error":"#VALUE!"}]
[45,null,null,null,null,null,null,null,null,null,null,null,null,null,null,0,null,null,null,null,null," ","",null,1045,{"$error":"#VALUE!"},null,{"$error":"#VALUE!"},{"$error":"#VALUE!"},{"$error":"#VALUE!"}]
[46,null,null,null,null,null,null,null,null,null,null,null,null,null,null,0,null,null,null,null,null," ","",null,1046,{"$error":"#VALUE!"},null,{"$error":"#VALUE!"},{"$error":"#VALUE!"},{"$error":"#VALUE!"}]
[47,null,null,null,null,null,null,null,null,null,null,null,null,null,null,0,null,null,null,null,null," ","",null,1047,{"$error":"#VALUE!"},null,{"$error":"#VALUE!"},{"$error":"#VALUE!"},{"$error":"#VALUE!"}]
[48,null,null,null,null,null,null,null,null,null,null,null,null,null,null,0,null,null,null,null,null," ","",null,1048,{"$error":"#VALUE!"},null,{"$error":"#VALUE!"},{"$error":"#VALUE!"},{"$error":"#VALUE!"}]
[49,null,null,null,null,null,null,null,null,null,null,null,null,null,null,0,null,null,null,null,null," ","",null,1049,{"$error":"#VALUE!"},null,{"$error":"#VALUE!"},{"$error":"#VALUE!"},{"$error":"#VALUE!"}]
[50,null,null,null,null,null,null,null,null,null,null,null,null,null,null,0,null,null,null,null,null," ",{"$f":"IF(OR(ISBLANK(H58),H58=0),\"\",IF(AND($D$5=\"lll\",$G$5<>\"sen\"),AD58,IF(AND($D$5=\"ll\",$G$5<>\"sen\"),AC58,\"\")))","v":""},null,1050,{"$error":"#VALUE!"},null,{"$error":"#VALUE!"},{"$error":"#VALUE!"},{"$error":"#VALUE!"}]
[51,null,null,null,null,null,null,null,null,null,null,null,null,null,null,0,null,null,null,null,null," ","",null,1051,{"$error":"#VALUE!"},null,{"$error":"#VALUE!"},{"$error":"#VALUE!"},{"$error":"#VALUE!"}]
[52,null,null,null,null,null,null,null,null,null,null,null,null,null,null,0,null,null,null,null,null," ","",null,1052,{"$error":"#VALUE!"},null,{"$error":"#VALUE!"},{"$error":"#VALUE!"},{"$error":"#VALUE!"}]
[53,null,null,null,null,null,null,null,null,null,null,null,null,null,null,0,null,null,null,null,null," ","",null,1053,{"$error":"#VALUE!"},null,{"$error":"#VALUE!"},{"$error":"#VALUE!"},{"$error":"#VALUE!"}]
[54,null,null,null,null,null,null,null,null,null,null,null,null,null,null,0,null,null,null,null,null," ","",null,1054,{"$error":"#VALUE!"},null,{"$error":"#VALUE!"},{"$error":"#VALUE!"},{"$error":"#VALUE!"}]
[55,null,null,null,null,null,null,null,null,null,null,null,null,null,null,0,null,null,null,null,null," ","",null,1055,{"$error":"#VALUE!"},null,{"$error":"#VALUE!"},{"$error":"#VALUE!"},{"$error":"#VALUE!"}]
[56,null,null,null,null,null,null,null,null,null,null,null,null,null,null,0,null,null,null,null,null," ","",null,1056,{"$error":"#VALUE!"},null,{"$error":"#VALUE!"},{"$error":"#VALUE!"},{"$error":"#VALUE!"}]
[57,null,null,null,null,null,null,null,null,null,null,null,null,null,null,0,null,null,null,null,null," ","",null,1057,{"$error":"#VALUE!"},null,{"$error":"#VALUE!"},{"$error":"#VALUE!"},{"$error":"#VALUE!"}]
[58,null,null,null,null,null,null,null,null,null,null,null,null,null,null,0,null,null,null,null,null," ","",null,1058,{"$error":"#VALUE!"},null,{"$error":"#VALUE!"},{"$error":"#VALUE!"},{"$error":"#VALUE!"}]
[59,null,null,null,null,null,null,null,null,null,null,null,null,null,null,0,null,null,null,null,null," ","",null,1059,{"$error":"#VALUE!"},null,{"$error":"#VALUE!"},{"$error":"#VALUE!"},{"$error":"#VALUE!"}]
[60,null,null,null,null,null,null,null,null,null,null,null,null,null,null,0,null,null,null,null,null," ","",null,1060,{"$error":"#VALUE!"},null,{"$error":"#VALUE!"},{"$error":"#VALUE!"},{"$error":"#VALUE!"}]
[61,null,null,null,null,null,null,null,null,null,null,null,null,null,null,0,null,null,null,null,null," ","",null,1061,{"$error":"#VALUE!"},null,{"$error":"#VALUE!"},{"$error":"#VALUE!"},{"$error":"#VALUE!"}]
[62,null,null,null,null,null,null,null,null,null,null,null,null,null,null,0,null,null,null,null,null," ","",null,1062,{"$error":"#VALUE!"},null,{"$error":"#VALUE!"},{"$error":"#VALUE!"},{"$error":"#VALUE!"}]
[63,null,null,null,null,null,null,null,null,null,null,null,null,null,null,0,null,null,null,null,null," ","",null,1063,{"$error":"#VALUE!"},null,{"$error":"#VALUE!"},{"$error":"#VALUE!"},{"$error":"#VALUE!"}]
[64,null,null,null,null,null,null,null,null,null,null,null,null,null,null,0,null,null,null,null,null," ","",null,1064,{"$error":"#VALUE!"},null,{"$error":"#VALUE!"},{"$error":"#VALUE!"},{"$error":"#VALUE!"}]
[65,null,null,null,null,null,null,null,null,null,null,null,null,null,null,{"$f":"H73","v":0},null,null,null,null,null,{"$f":"B73&\" \"&C73","v":" "},"",null,{"$f":"IF(OR(H73=0,ISBLANK(H73)),1000+A73,IF(ISNUMBER(H73),H73,MID(H73,4,5)))","v":1065},{"$f":"IF(AB73=\"tss\",Y73+100000,IF(AB73=\"te\",Y73+50000,IF(AB73=\"itf\",Y73+10000,Y73)))","v":{"$error":"#VALUE!"}},null,{"$f":"IF(ISNUMBER(H73),\"tss\",LEFT(H73,FIND(\" \",H73)-1))","v":{"$error":"#VALUE!"}},{"$f":"IF(AB73=\"atp\",\"NE MOŽE DA IGRA!!!\",IF(AND(AB73=\"itf\",Z73<10201),\"NE MOŽE DA IGRA!!!\",IF(AND(AB73=\"TE\",Z73<50201),\"NE MOŽE DA IGRA!!!\",IF(AND(AB73=\"TSS\",Z73<100011),\"NE MOŽE DA IGRA!!!\",\"\"))))","v":{"$error":"#VALUE!"}},{"$f":"IF(AB73=\"atp\",\"NE MOŽE DA IGRA!!!\",IF(AND(AB73=\"itf\",Z73<10201),\"NE MOŽE DA IGRA!!!\",IF(AND(AB73=\"TE\",Z73<50201),\"NE MOŽE DA IGRA!!!\",IF(AND(AB73=\"TSS\",Z73<100021),\"NE MOŽE DA IGRA!!!\",\"\"))))","v":{"$error":"#VALUE!"}}]
[66,null,null,null,null,null,null,null,null,null,null,null,null,null,null,0,null,null,null,null,null," ","",null,1066,{"$error":"#VALUE!"},null,{"$error":"#VALUE!"},{"$error":"#VALUE!"},{"$error":"#VALUE!"}]
[67,null,null,null,null,null,null,null,null,null,null,null,null,null,null,0,null,null,null,null,null," ",null,null,1067,{"$error":"#VALUE!"},null,{"$error":"#VALUE!"},{"$error":"#VALUE!"},{"$error":"#VALUE!"}]
[68,null,null,null,null,null,null,null,null,null,null,null,null,null,null,0,null,null,null,null,null," ",null,null,1068,{"$error":"#VALUE!"},null,{"$error":"#VALUE!"},{"$error":"#VALUE!"},{"$error":"#VALUE!"}]
[69,null,null,null,null,null,null,null,null,null,null,null,null,null,null,0,null,null,null,null,null," ",null,null,1069,{"$error":"#VALUE!"},null,{"$error":"#VALUE!"},{"$error":"#VALUE!"},{"$error":"#VALUE!"}]
[70,null,null,null,null,null,null,null,null,null,null,null,null,null,null,0,null,null,null,null,null," ",null,null,1070,{"$error":"#VALUE!"},null,{"$error":"#VALUE!"},{"$error":"#VALUE!"},{"$error":"#VALUE!"}]
[71,null,null,null,null,null,null,null,null,null,null,null,null,null,null,0,null,null,null,null,null," ",null,null,1071,{"$error":"#VALUE!"},null,{"$error":"#VALUE!"},{"$error":"#VALUE!"},{"$error":"#VALUE!"}]
[72,null,null,null,null,null,null,null,null,null,null,null,null,null,null,0,null,null,null,null,null," ",null,null,1072,{"$error":"#VALUE!"},null,{"$error":"#VALUE!"},{"$error":"#VALUE!"},{"$error":"#VALUE!"}]
[73,null,null,null,null,null,null,null,null,null,null,null,null,null,null,0,null,null,null,null,null," ",null,null,1073,{"$error":"#VALUE!"},null,{"$error":"#VALUE!"},{"$error":"#VALUE!"},{"$error":"#VALUE!"}]
[74,null,null,null,null,null,null,null,null,null,null,null,null,null,null,0,null,null,null,null,null," ",null,null,1074,{"$error":"#VALUE!"},null,{"$error":"#VALUE!"},{"$error":"#VALUE!"},{"$error":"#VALUE!"}]
[75,null,null,null,null,null,null,null,null,null,null,null,null,null,null,0,null,null,null,null,null," ",null,null,1075,{"$error":"#VALUE!"},null,{"$error":"#VALUE!"},{"$error":"#VALUE!"},{"$error":"#VALUE!"}]
[76,null,null,null,null,null,null,null,null,null,null,null,null,null,null,0,null,null,null,null,null," ",null,null,1076,{"$error":"#VALUE!"},null,{"$error":"#VALUE!"},{"$error":"#VALUE!"},{"$error":"#VALUE!"}]
[77,null,null,null,null,null,null,null,null,null,null,null,null,null,null,0,null,null,null,null,null," ",null,null,1077,{"$error":"#VALUE!"},null,{"$error":"#VALUE!"},{"$error":"#VALUE!"},{"$error":"#VALUE!"}]
[78,null,null,null,null,null,null,null,null,null,null,null,null,null,null,0,null,null,null,null,null," ",null,null,1078,{"$error":"#VALUE!"},null,{"$error":"#VALUE!"},{"$error":"#VALUE!"},{"$error":"#VALUE!"}]
[79,null,null,null,null,null,null,null,null,null,null,null,null,null,null,0,null,null,null,null,null," ",null,null,1079,{"$error":"#VALUE!"},null,{"$error":"#VALUE!"},{"$error":"#VALUE!"},{"$error":"#VALUE!"}]
[80,null,null,null,null,null,null,null,null,null,null,null,null,null,null,0,null,null,null,null,null," ",null,null,1080,{"$error":"#VALUE!"},null,{"$error":"#VALUE!"},{"$error":"#VALUE!"},{"$error":"#VALUE!"}]
[81,null,null,null,null,null,null,null,null,null,null,null,null,null,null,0,null,null,null,null,null," ",null,null,1081,{"$error":"#VALUE!"},null,{"$error":"#VALUE!"},{"$error":"#VALUE!"},{"$error":"#VALUE!"}]
[82,null,null,null,null,null,null,null,null,null,null,null,null,null,null,0,null,null,null,null,null," ",null,null,1082,{"$error":"#VALUE!"},null,{"$error":"#VALUE!"},{"$error":"#VALUE!"},{"$error":"#VALUE!"}]
[83,null,null,null,null,null,null,null,null,null,null,null,null,null,null,0,null,null,null,null,null," ",null,null,1083,{"$error":"#VALUE!"},null,{"$error":"#VALUE!"},{"$error":"#VALUE!"},{"$error":"#VALUE!"}]
[84,null,null,null,null,null,null,null,null,null,null,null,null,null,null,0,null,null,null,null,null," ",null,null,1084,{"$error":"#VALUE!"},null,{"$error":"#VALUE!"},{"$error":"#VALUE!"},{"$error":"#VALUE!"}]
[85,null,null,null,null,null,null,null,null,null,null,null,null,null,null,0,null,null,null,null,null," ",null,null,1085,{"$error":"#VALUE!"},null,{"$error":"#VALUE!"},{"$error":"#VALUE!"},{"$error":"#VALUE!"}]
[86,null,null,null,null,null,null,null,null,null,null,null,null,null,null,0,null,null,null,null,null," ",null,null,1086,{"$error":"#VALUE!"},null,{"$error":"#VALUE!"},{"$error":"#VALUE!"},{"$error":"#VALUE!"}]
[87,null,null,null,null,null,null,null,null,null,null,null,null,null,null,0,null,null,null,null,null," ",null,null,1087,{"$error":"#VALUE!"},null,{"$error":"#VALUE!"},{"$error":"#VALUE!"},{"$error":"#VALUE!"}]
[88,null,null,null,null,null,null,null,null,null,null,null,null,null,null,0,null,null,null,null,null," ",null,null,1088,{"$error":"#VALUE!"},null,{"$error":"#VALUE!"},{"$error":"#VALUE!"},{"$error":"#VALUE!"}]
[89,null,null,null,null,null,null,null,null,null,null,null,null,null,null,0,null,null,null,null,null," ",null,null,1089,{"$error":"#VALUE!"},null,{"$error":"#VALUE!"},{"$error":"#VALUE!"},{"$error":"#VALUE!"}]
[90,null,null,null,null,null,null,null,null,null,null,null,null,null,null,0,null,null,null,null,null," ",null,null,1090,{"$error":"#VALUE!"},null,{"$error":"#VALUE!"},{"$error":"#VALUE!"},{"$error":"#VALUE!"}]
[91,null,null,null,null,null,null,null,null,null,null,null,null,null,null,0,null,null,null,null,null," ",null,null,1091,{"$error":"#VALUE!"},null,{"$error":"#VALUE!"},{"$error":"#VALUE!"},{"$error":"#VALUE!"}]
[92,null,null,null,null,null,null,null,null,null,null,null,null,null,null,0,null,null,null,null,null," ",null,null,1092,{"$error":"#VALUE!"},null,{"$error":"#VALUE!"},{"$error":"#VALUE!"},{"$error":"#VALUE!"}]
[93,null,null,null,null,null,null,null,null,null,null,null,null,null,null,0,null,null,null,null,null," ",null,null,1093,{"$error":"#VALUE!"},null,{"$error":"#VALUE!"},{"$error":"#VALUE!"},{"$error":"#VALUE!"}]
[94,null,null,null,null,null,null,null,null,null,null,null,null,null,null,0,null,null,null,null,null," ",null,null,1094,{"$error":"#VALUE!"},null,{"$error":"#VALUE!"},{"$error":"#VALUE!"},{"$error":"#VALUE!"}]
[95,null,null,null,null,null,null,null,null,null,null,null,null,null,null,0,null,null,null,null,null," ",null,null,1095,{"$error":"#VALUE!"},null,{"$error":"#VALUE!"},{"$error":"#VALUE!"},{"$error":"#VALUE!"}]
[96,null,null,null,null,null,null,null,null,null,null,null,null,null,null,0,null,null,null,null,null," ",null,null,1096,{"$error":"#VALUE!"},null,{"$error":"#VALUE!"},{"$error":"#VALUE!"},{"$error":"#VALUE!"}]
[97,null,null,null,null,null,null,null,null,null,null,null,null,null,null,{"$f":"H105","v":0},null,null,null,null,null,{"$f":"B105&\" \"&C105","v":" "},null,null,{"$f":"IF(OR(H105=0,ISBLANK(H105)),1000+A105,IF(ISNUMBER(H105),H105,MID(H105,4,5)))","v":1097},{"$f":"IF(AB105=\"tss\",Y105+100000,IF(AB105=\"te\",Y105+50000,IF(AB105=\"itf\",Y105+10000,Y105)))","v":{"$error":"#VALUE!"}},null,{"$f":"IF(ISNUMBER(H105),\"tss\",LEFT(H105,FIND(\" \",H105)-1))","v":{"$error":"#VALUE!"}},{"$error":"#VALUE!"},{"$error":"#VALUE!"}]
[98,null,null,null,null,null,null,null,null,null,null,null,null,null,null,0,null,null,null,null,null," ",null,null,1098,{"$error":"#VALUE!"},null,{"$error":"#VALUE!"},{"$error":"#VALUE!"},{"$error":"#VALUE!"}]
[99,null,null,null,null,null,null,null,null,null,null,null,null,null,null,0,null,null,null,null,null," ",null,null,1099,{"$error":"#VALUE!"},null,{"$error":"#VALUE!"},{"$error":"#VALUE!"},{"$error":"#VALUE!"}]
[100,null,null,null,null,null,null,null,null,null,null,null,null,null,null,0,null,null,null,null,null," ",null,null,1100,{"$error":"#VALUE!"},null,{"$error":"#VALUE!"},{"$error":"#VALUE!"},{"$error":"#VALUE!"}]
[101,null,null,null,null,null,null,null,null,null,null,null,null,null,null,0,null,null,null,null,null," ",null,null,1101,{"$error":"#VALUE!"},null,{"$error":"#VALUE!"},{"$error":"#VALUE!"},{"$error":"#VALUE!"}]
[102,null,null,null,null,null,null,null,null,null,null,null,null,null,null,0,null,null,null,null,null," ",null,null,1102,{"$error":"#VALUE!"},null,{"$error":"#VALUE!"},{"$error":"#VALUE!"},{"$error":"#VALUE!"}]
[103,null,null,null,null,null,null,null,null,null,null,null,null,null,null,0,null,null,null,null,null," ",null,null,1103,{"$error":"#VALUE!"},null,{"$error":"#VALUE!"},{"$error":"#VALUE!"},{"$error":"#VALUE!"}]
[104,null,null,null,null,null,null,null,null,null,null,null,null,null,null,0,null,null,null,null,null," ",null,null,1104,{"$error":"#VALUE!"},null,{"$error":"#VALUE!"},{"$error":"#VALUE!"},{"$error":"#VALUE!"}]
[105,null,null,null,null,null,null,null,null,null,null,null,null,null,null,0,null,null,null,null,null," ",null,null,1105,{"$error":"#VALUE!"},null,{"$error":"#VALUE!"},{"$error":"#VALUE!"},{"$error":"#VALUE!"}]
[106,null,null,null,null,null,null,null,null,null,null,null,null,null,null,0,null,null,null,null,null," ",null,null,1106,{"$error":"#VALUE!"},null,{"$error":"#VALUE!"},{"$error":"#VALUE!"},{"$error":"#VALUE!"}]
[107,null,null,null,null,null,null,null,null,null,null,null,null,null,null,0,null,null,null,null,null," ",null,null,1107,{"$error":"#VALUE!"},null,{"$error":"#VALUE!"},{"$error":"#VALUE!"},{"$error":"#VALUE!"}]
[108,null,null,null,null,null,null,null,null,null,null,null,null,null,null,0,null,null,null,null,null," ",null,null,1108,{"$error":"#VALUE!"},null,{"$error":"#VALUE!"},{"$error":"#VALUE!"},{"$error":"#VALUE!"}]
[109,null,null,null,null,null,null,null,null,null,null,null,null,null,null,0,null,null,null,null,null," ",null,null,1109,{"$error":"#VALUE!"},null,{"$error":"#VALUE!"},{"$error":"#VALUE!"},{"$error":"#VALUE!"}]
[110,null,null,null,null,null,null,null,null,null,null,null,null,null,null,0,null,null,null,null,null," ",null,null,1110,{"$error":"#VALUE!"},null,{"$error":"#VALUE!"},{"$error":"#VALUE!"},{"$error":"#VALUE!"}]
[111,null,null,null,null,null,null,null,null,null,null,null,null,null,null,0,null,null,null,null,null," ",null,null,1111,{"$error":"#VALUE!"},null,{"$error":"#VALUE!"},{"$error":"#VALUE!"},{"$error":"#VALUE!"}]
[112,null,null,null,null,null,null,null,null,null,null,null,null,null,null,0,null,null,null,null,null," ",null,null,1112,{"$error":"#VALUE!"},null,{"$error":"#VALUE!"},{"$error":"#VALUE!"},{"$error":"#VALUE!"}]
[113,null,null,null,null,null,null,null,null,null,null,null,null,null,null,0,null,null,null,null,null," ",null,null,1113,{"$error":"#VALUE!"},null,{"$error":"#VALUE!"},{"$error":"#VALUE!"},{"$error":"#VALUE!"}]
[114,null,null,null,null,null,null,null,null,null,null,null,null,null,null,0,null,null,null,null,null," ",null,null,1114,{"$error":"#VALUE!"},null,{"$error":"#VALUE!"},{"$error":"#VALUE!"},{"$error":"#VALUE!"}]
[115,null,null,null,null,null,null,null,null,null,null,null,null,null,null,0,null,null,null,null,null," ",null,null,1115,{"$error":"#VALUE!"},null,{"$error":"#VALUE!"},{"$error":"#VALUE!"},{"$error":"#VALUE!"}]
[116,null,null,null,null,null,null,null,null,null,null,null,null,null,null,0,null,null,null,null,null," ",null,null,1116,{"$error":"#VALUE!"},null,{"$error":"#VALUE!"},{"$error":"#VALUE!"},{"$error":"#VALUE!"}]
[117,null,null,null,null,null,null,null,null,null,null,null,null,null,null,0,null,null,null,null,null," ",null,null,1117,{"$error":"#VALUE!"},null,{"$error":"#VALUE!"},{"$error":"#VALUE!"},{"$error":"#VALUE!"}]
[118,null,null,null,null,null,null,null,null,null,null,null,null,null,null,0,null,null,null,null,null," ",null,null,1118,{"$error":"#VALUE!"},null,{"$error":"#VALUE!"},{"$error":"#VALUE!"},{"$error":"#VALUE!"}]
[119,null,null,null,null,null,null,null,null,null,null,null,null,null,null,0,null,null,null,null,null," ",null,null,1119,{"$error":"#VALUE!"},null,{"$error":"#VALUE!"},{"$error":"#VALUE!"},{"$error":"#VALUE!"}]
[120,null,null,null,null,null,null,null,null,null,null,null,null,null,null,0,null,null,null,null,null," ",null,null,1120,{"$error":"#VALUE!"},null,{"$error":"#VALUE!"},{"$error":"#VALUE!"},{"$error":"#VALUE!"}]
[121,null,null,null,null,null,null,null,null,null,null,null,null,null,null,0,null,null,null,null,null," ",null,null,1121,{"$error":"#VALUE!"},null,{"$error":"#VALUE!"},{"$error":"#VALUE!"},{"$error":"#VALUE!"}]
[122,null,null,null,null,null,null,null,null,null,null,null,null,null,null,0,null,null,null,null,null," ",null,null,1122,{"$error":"#VALUE!"},null,{"$error":"#VALUE!"},{"$error":"#VALUE!"},{"$error":"#VALUE!"}]
[123,null,null,null,null,null,null,null,null,null,null,null,null,null,null,0,null,null,null,null,null," ",null,null,1123,{"$error":"#VALUE!"},null,{"$error":"#VALUE!"},{"$error":"#VALUE!"},{"$error":"#VALUE!"}]
[124,null,null,null,null,null,null,null,null,null,null,null,null,null,null,0,null,null,null,null,null," ",null,null,1124,{"$error":"#VALUE!"},null,{"$error":"#VALUE!"},{"$error":"#VALUE!"},{"$error":"#VALUE!"}]
[125,null,null,null,null,null,null,null,null,null,null,null,null,null,null,0,null,null,null,null,null," ",null,null,1125,{"$error":"#VALUE!"},null,{"$error":"#VALUE!"},{"$error":"#VALUE!"},{"$error":"#VALUE!"}]
[126,null,null,null,null,null,null,null,null,null,null,null,null,null,null,0,null,null,null,null,null," ",null,null,1126,{"$error":"#VALUE!"},null,{"$error":"#VALUE!"},{"$error":"#VALUE!"},{"$error":"#VALUE!"}]
[127,null,null,null,null,null,null,null,null,null,null,null,null,null,null,0,null,null,null,null,null," ",null,null,1127,{"$error":"#VALUE!"},null,{"$error":"#VALUE!"},{"$error":"#VALUE!"},{"$error":"#VALUE!"}]
[128,null,null,null,null,null,null,null,null,null,null,null,null,null,null,0,null,null,null,null,null," "]

{"sheet":"Zreb CEO 10","index":4,"n_rows":37,"n_cols":21,"rows_kept":37,"cut":false,"hidden":false,"merged":[[30,16,31,16],[30,10,30,15],[30,2,30,7],[1,0,1,20],[11,0,11,20],[20,0,20,20],[29,0,29,20],[2,10,2,15],[12,10,12,15],[12,2,12,7],[21,2,21,7],[21,10,21,15],[2,2,2,7],[2,16,3,16],[12,16,13,16],[21,16,22,16]]}
[]
["KOLO 1"]
[null,null,"IGRAC  1",null,null,null,null,null,null,null,"IGRAC 2",null,null,null,null,null,"POBEDNIK\n1 ILI 2"]
[null,"sifra igrac1","PREZIME","IME","KLUB","DATUM ROĐENJA","TAKMIČARSKA LEGITIMACIJA",{"$f":"C4&\" \"&D4&\" (\"&E4&\")\"","v":"PREZIME IME (KLUB)"},null,"sifra igrac2","PREZIME","IME","KLUB","DATUM ROĐENJA","TAKMIČARSKA LEGITIMACIJA",{"$f":"K4&\" \"&L4&\" (\"&M4&\")\"","v":"PREZIME IME (KLUB)"},null,"sifra w","sifra L","POBEDNIK","REZULTAT"]
["MEC 1",null,{"$f":"UPPER(IF(($B5=0) + ($B5=\" \"),\"\",VLOOKUP($B5,'PRIPREMA '!$A$8:$C$24,2)))","v":""},{"$f":"UPPER(IF(($B5=0) + ($B5=\" \"),\"\",VLOOKUP($B5,'PRIPREMA '!$A$8:$C$24,3)))","v":""},{"$f":"UPPER(IF(($B5=0) + ($B5=\" \"),\"\",\"(\"&(VLOOKUP($B5,'PRIPREMA '!$A$8:$E$24,4)&\")\")))","v":""},{"$f":"UPPER(IF(($B5=0) + ($B5=\" \"),\"\",VLOOKUP($B5,'PRIPREMA '!$A$8:$E$24,5)))","v":""},{"$f":"UPPER(IF(($B5=0) + ($B5=\" \"),\"\",VLOOKUP($B5,'PRIPREMA '!$A$8:$G$24,6)))","v":""},"Ristic Ognjen (SLA)","VS",null,{"$f":"UPPER(IF(($J5=0) + ($J5=\" \"),\"\",VLOOKUP($J5,'PRIPREMA '!$A$8:$C$24,2)))","v":""},{"$f":"UPPER(IF(($J5=0) + ($J5=\" \"),\"\",VLOOKUP($J5,'PRIPREMA '!$A$8:$C$24,3)))","v":""},{"$f":"UPPER(IF(($J5=0) + ($J5=\" \"),\"\",\"(\"&(VLOOKUP($J5,'PRIPREMA '!$A$8:$F$24,4)&\")\")))","v":""},null,{"$f":"UPPER(IF(($J5=0) + ($J5=\" \"),\"\",VLOOKUP($J5,'PRIPREMA '!$A$8:$F$24,6)))","v":""},"Stepanovic Novak (AST)",null,{"$f":"IF($Q5=1,$B5,IF($Q5=2,$J5,\" \"))","v":" "},{"$f":"IF($Q5=1,$J5,IF($Q5=2,$B5,\" \"))","v":" "},{"$f":"UPPER(IF(($R5=0)+($R5=\" \"),\"\",(VLOOKUP($R5,'PRIPREMA '!$A$8:$H$24,2)&\" \"&(VLOOKUP($R5,'PRIPREMA '!$A$8:$H$24,3)&\" (\"&(VLOOKUP($R5,'PRIPREMA '!$A$8:$H$24,4)&\")\")))))","v":""}]
["MEC 2",null,{"$f":"UPPER(IF(($B6=0) + ($B6=\" \"),\"\",VLOOKUP($B6,'PRIPREMA '!$A$8:$C$24,2)))","v":""},{"$f":"UPPER(IF(($B6=0) + ($B6=\" \"),\"\",VLOOKUP($B6,'PRIPREMA '!$A$8:$C$24,3)))","v":""},{"$f":"UPPER(IF(($B6=0) + ($B6=\" \"),\"\",\"(\"&(VLOOKUP($B6,'PRIPREMA '!$A$8:$E$24,4)&\")\")))","v":""},{"$f":"UPPER(IF(($B6=0) + ($B6=\" \"),\"\",VLOOKUP($B6,'PRIPREMA '!$A$8:$E$24,5)))","v":""},{"$f":"UPPER(IF(($B6=0) + ($B6=\" \"),\"\",VLOOKUP($B6,'PRIPREMA '!$A$8:$G$24,6)))","v":""},"Aleksic Jovan (TOP)","VS",null,{"$f":"UPPER(IF(($J6=0) + ($J6=\" \"),\"\",VLOOKUP($J6,'PRIPREMA '!$A$8:$C$24,2)))","v":""},{"$f":"UPPER(IF(($J6=0) + ($J6=\" \"),\"\",VLOOKUP($J6,'PRIPREMA '!$A$8:$C$24,3)))","v":""},{"$f":"UPPER(IF(($J6=0) + ($J6=\" \"),\"\",\"(\"&(VLOOKUP($J6,'PRIPREMA '!$A$8:$F$24,4)&\")\")))","v":""},null,{"$f":"UPPER(IF(($J6=0) + ($J6=\" \"),\"\",VLOOKUP($J6,'PRIPREMA '!$A$8:$F$24,6)))","v":""},"Milic Milos (SLA)",null," "," ",{"$f":"UPPER(IF(($R6=0)+($R6=\" \"),\"\",(VLOOKUP($R6,'PRIPREMA '!$A$8:$H$24,2)&\" \"&(VLOOKUP($R6,'PRIPREMA '!$A$8:$H$24,3)&\" (\"&(VLOOKUP($R6,'PRIPREMA '!$A$8:$H$24,4)&\")\")))))","v":""}]
["MEC 3",null,{"$f":"UPPER(IF(($B7=0) + ($B7=\" \"),\"\",VLOOKUP($B7,'PRIPREMA '!$A$8:$C$24,2)))","v":""},{"$f":"UPPER(IF(($B7=0) + ($B7=\" \"),\"\",VLOOKUP($B7,'PRIPREMA '!$A$8:$C$24,3)))","v":""},{"$f":"UPPER(IF(($B7=0) + ($B7=\" \"),\"\",\"(\"&(VLOOKUP($B7,'PRIPREMA '!$A$8:$E$24,4)&\")\")))","v":""},{"$f":"UPPER(IF(($B7=0) + ($B7=\" \"),\"\",VLOOKUP($B7,'PRIPREMA '!$A$8:$E$24,5)))","v":""},{"$f":"UPPER(IF(($B7=0) + ($B7=\" \"),\"\",VLOOKUP($B7,'PRIPREMA '!$A$8:$G$24,6)))","v":""},"Mladenovic Janko (AST)","VS",null,{"$f":"UPPER(IF(($J7=0) + ($J7=\" \"),\"\",VLOOKUP($J7,'PRIPREMA '!$A$8:$C$24,2)))","v":""},{"$f":"UPPER(IF(($J7=0) + ($J7=\" \"),\"\",VLOOKUP($J7,'PRIPREMA '!$A$8:$C$24,3)))","v":""},{"$f":"UPPER(IF(($J7=0) + ($J7=\" \"),\"\",\"(\"&(VLOOKUP($J7,'PRIPREMA '!$A$8:$F$24,4)&\")\")))","v":""},null,{"$f":"UPPER(IF(($J7=0) + ($J7=\" \"),\"\",VLOOKUP($J7,'PRIPREMA '!$A$8:$F$24,6)))","v":""},"Stanimirovic Vukan (SLA)",null," "," ",{"$f":"UPPER(IF(($R7=0)+($R7=\" \"),\"\",(VLOOKUP($R7,'PRIPREMA '!$A$8:$H$24,2)&\" \"&(VLOOKUP($R7,'PRIPREMA '!$A$8:$H$24,3)&\" (\"&(VLOOKUP($R7,'PRIPREMA '!$A$8:$H$24,4)&\")\")))))","v":""}]
["MEC 4",null,{"$f":"UPPER(IF(($B8=0) + ($B8=\" \"),\"\",VLOOKUP($B8,'PRIPREMA '!$A$8:$C$24,2)))","v":""},{"$f":"UPPER(IF(($B8=0) + ($B8=\" \"),\"\",VLOOKUP($B8,'PRIPREMA '!$A$8:$C$24,3)))","v":""},{"$f":"UPPER(IF(($B8=0) + ($B8=\" \"),\"\",\"(\"&(VLOOKUP($B8,'PRIPREMA '!$A$8:$E$24,4)&\")\")))","v":""},{"$f":"UPPER(IF(($B8=0) + ($B8=\" \"),\"\",VLOOKUP($B8,'PRIPREMA '!$A$8:$E$24,5)))","v":""},{"$f":"UPPER(IF(($B8=0) + ($B8=\" \"),\"\",VLOOKUP($B8,'PRIPREMA '!$A$8:$G$24,6)))","v":""},"Jovanovic Filip (TAZ)","VS",null,{"$f":"UPPER(IF(($J8=0) + ($J8=\" \"),\"\",VLOOKUP($J8,'PRIPREMA '!$A$8:$C$24,2)))","v":""},{"$f":"UPPER(IF(($J8=0) + ($J8=\" \"),\"\",VLOOKUP($J8,'PRIPREMA '!$A$8:$C$24,3)))","v":""},{"$f":"UPPER(IF(($J8=0) + ($J8=\" \"),\"\",\"(\"&(VLOOKUP($J8,'PRIPREMA '!$A$8:$F$24,4)&\")\")))","v":""},null,{"$f":"UPPER(IF(($J8=0) + ($J8=\" \"),\"\",VLOOKUP($J8,'PRIPREMA '!$A$8:$F$24,6)))","v":""},"Vujcic Veljko (SLA)",null," "," ",{"$f":"UPPER(IF(($R8=0)+($R8=\" \"),\"\",(VLOOKUP($R8,'PRIPREMA '!$A$8:$H$24,2)&\" \"&(VLOOKUP($R8,'PRIPREMA '!$A$8:$H$24,3)&\" (\"&(VLOOKUP($R8,'PRIPREMA '!$A$8:$H$24,4)&\")\")))))","v":""}]
["MEC 5",null,null,null,null,null,null,"Stanimirovic Rastko (SLA)","VS",null,null,null,null,null,null,"Ognjanovic Sava (TOP)",null,null,null,{"$f":"UPPER(IF(($R9=0)+($R9=\" \"),\"\",(VLOOKUP($R9,'PRIPREMA '!$A$8:$H$24,2)&\" \"&(VLOOKUP($R9,'PRIPREMA '!$A$8:$H$24,3)&\" (\"&(VLOOKUP($R9,'PRIPREMA '!$A$8:$H$24,4)&\")\")))))","v":""}]
["MEC 6",null,{"$f":"UPPER(IF(($B10=0) + ($B10=\" \"),\"\",VLOOKUP($B10,'PRIPREMA '!$A$8:$C$24,2)))","v":""},{"$f":"UPPER(IF(($B10=0) + ($B10=\" \"),\"\",VLOOKUP($B10,'PRIPREMA '!$A$8:$C$24,3)))","v":""},{"$f":"UPPER(IF(($B10=0) + ($B10=\" \"),\"\",\"(\"&(VLOOKUP($B10,'PRIPREMA '!$A$8:$E$24,4)&\")\")))","v":""},{"$f":"UPPER(IF(($B10=0) + ($B10=\" \"),\"\",VLOOKUP($B10,'PRIPREMA '!$A$8:$E$24,5)))","v":""},{"$f":"UPPER(IF(($B10=0) + ($B10=\" \"),\"\",VLOOKUP($B10,'PRIPREMA '!$A$8:$G$24,6)))","v":""},"Djordevic Veljko (AST)","VS",null,{"$f":"UPPER(IF(($J10=0) + ($J10=\" \"),\"\",VLOOKUP($J10,'PRIPREMA '!$A$8:$C$24,2)))","v":""},{"$f":"UPPER(IF(($J10=0) + ($J10=\" \"),\"\",VLOOKUP($J10,'PRIPREMA '!$A$8:$C$24,3)))","v":""},{"$f":"UPPER(IF(($J10=0) + ($J10=\" \"),\"\",\"(\"&(VLOOKUP($J10,'PRIPREMA '!$A$8:$F$24,4)&\")\")))","v":""},null,{"$f":"UPPER(IF(($J10=0) + ($J10=\" \"),\"\",VLOOKUP($J10,'PRIPREMA '!$A$8:$F$24,6)))","v":""},null,null," "," ",{"$f":"UPPER(IF(($R10=0)+($R10=\" \"),\"\",(VLOOKUP($R10,'PRIPREMA '!$A$8:$H$24,2)&\" \"&(VLOOKUP($R10,'PRIPREMA '!$A$8:$H$24,3)&\" (\"&(VLOOKUP($R10,'PRIPREMA '!$A$8:$H$24,4)&\")\")))))","v":""}]
[]
["KOLO 2"]
[null,null,"IGRAC  1",null,null,null,null,null,null,null,"IGRAC 2",null,null,null,null,null,"POBEDNIK\n1 ILI 2"]
[null,"sifra igrac1","PREZIME","IME","KLUB","DATUM ROĐENJA","TAKMIČARSKA LEGITIMACIJA",{"$f":"C14&\" \"&D14&\" (\"&E14&\")\"","v":"PREZIME IME (KLUB)"},null,"sifra igrac2","PREZIME","IME","KLUB","DATUM ROĐENJA","TAKMIČARSKA LEGITIMACIJA",{"$f":"K14&\" \"&L14&\" (\"&M14&\")\"","v":"PREZIME IME (KLUB)"},null,"sifra w","sifra L",null,"REZULTAT"]
["MEC 1",{"$f":"R5","v":" "},{"$f":"UPPER(IF(($B15=0) + ($B15=\" \"),\"\",VLOOKUP($B15,'PRIPREMA '!$A$8:$C$24,2)))","v":""},{"$f":"UPPER(IF(($B15=0) + ($B15=\" \"),\"\",VLOOKUP($B15,'PRIPREMA '!$A$8:$C$24,3)))","v":""},{"$f":"UPPER(IF(($B15=0) + ($B15=\" \"),\"\",\"(\"&(VLOOKUP($B15,'PRIPREMA '!$A$8:$E$24,4)&\")\")))","v":""},{"$f":"UPPER(IF(($B15=0) + ($B15=\" \"),\"\",VLOOKUP($B15,'PRIPREMA '!$A$8:$E$24,5)))","v":""},{"$f":"UPPER(IF(($B15=0) + ($B15=\" \"),\"\",VLOOKUP($B15,'PRIPREMA '!$A$8:$G$24,6)))","v":""},{"$f":"C15&\" \"&D15&E15","v":" "},"VS",{"$f":"R6","v":" "},{"$f":"UPPER(IF(($J15=0) + ($J15=\" \"),\"\",VLOOKUP($J15,'PRIPREMA '!$A$8:$C$24,2)))","v":""},{"$f":"UPPER(IF(($J15=0) + ($J15=\" \"),\"\",VLOOKUP($J15,'PRIPREMA '!$A$8:$C$24,3)))","v":""},{"$f":"UPPER(IF(($J15=0) + ($J15=\" \"),\"\",\"(\"&(VLOOKUP($J15,'PRIPREMA '!$A$8:$F$24,4)&\")\")))","v":""},null,{"$f":"UPPER(IF(($J15=0) + ($J15=\" \"),\"\",VLOOKUP($J15,'PRIPREMA '!$A$8:$F$24,6)))","v":""},{"$f":"K15&\" \"&L15&M15","v":" "},null,{"$f":"IF($Q15=1,$B15,IF($Q15=2,$J15,\" \"))","v":" "},{"$f":"IF($Q15=1,$J15,IF($Q15=2,$B15,\" \"))","v":" "},{"$f":"UPPER(IF(($R15=0)+($R15=\" \"),\"\",(VLOOKUP($R15,'PRIPREMA '!$A$8:$H$24,2)&\" \"&(VLOOKUP($R15,'PRIPREMA '!$A$8:$H$24,3)&\" (\"&(VLOOKUP($R15,'PRIPREMA '!$A$8:$H$24,4)&\")\")))))","v":""}]
["MEC 2",{"$f":"R7","v":" "},{"$f":"UPPER(IF(($B16=0) + ($B16=\" \"),\"\",VLOOKUP($B16,'PRIPREMA '!$A$8:$C$24,2)))","v":""},{"$f":"UPPER(IF(($B16=0) + ($B16=\" \"),\"\",VLOOKUP($B16,'PRIPREMA '!$A$8:$C$24,3)))","v":""},{"$f":"UPPER(IF(($B16=0) + ($B16=\" \"),\"\",\"(\"&(VLOOKUP($B16,'PRIPREMA '!$A$8:$E$24,4)&\")\")))","v":""},{"$f":"UPPER(IF(($B16=0) + ($B16=\" \"),\"\",VLOOKUP($B16,'PRIPREMA '!$A$8:$E$24,5)))","v":""},{"$f":"UPPER(IF(($B16=0) + ($B16=\" \"),\"\",VLOOKUP($B16,'PRIPREMA '!$A$8:$G$24,6)))","v":""}," ","VS",{"$f":"R8","v":" "},{"$f":"UPPER(IF(($J16=0) + ($J16=\" \"),\"\",VLOOKUP($J16,'PRIPREMA '!$A$8:$C$24,2)))","v":""},{"$f":"UPPER(IF(($J16=0) + ($J16=\" \"),\"\",VLOOKUP($J16,'PRIPREMA '!$A$8:$C$24,3)))","v":""},{"$f":"UPPER(IF(($J16=0) + ($J16=\" \"),\"\",\"(\"&(VLOOKUP($J16,'PRIPREMA '!$A$8:$F$24,4)&\")\")))","v":""},null,{"$f":"UPPER(IF(($J16=0) + ($J16=\" \"),\"\",VLOOKUP($J16,'PRIPREMA '!$A$8:$F$24,6)))","v":""}," ",null," "," ",{"$f":"UPPER(IF(($R16=0)+($R16=\" \"),\"\",(VLOOKUP($R16,'PRIPREMA '!$A$8:$H$24,2)&\" \"&(VLOOKUP($R16,'PRIPREMA '!$A$8:$H$24,3)&\" (\"&(VLOOKUP($R16,'PRIPREMA '!$A$8:$H$24,4)&\")\")))))","v":""}]
["MEC 3",{"$f":"R10","v":" "},{"$f":"UPPER(IF(($B17=0) + ($B17=\" \"),\"\",VLOOKUP($B17,'PRIPREMA '!$A$8:$C$24,2)))","v":""},{"$f":"UPPER(IF(($B17=0) + ($B17=\" \"),\"\",VLOOKUP($B17,'PRIPREMA '!$A$8:$C$24,3)))","v":""},{"$f":"UPPER(IF(($B17=0) + ($B17=\" \"),\"\",\"(\"&(VLOOKUP($B17,'PRIPREMA '!$A$8:$E$24,4)&\")\")))","v":""},{"$f":"UPPER(IF(($B17=0) + ($B17=\" \"),\"\",VLOOKUP($B17,'PRIPREMA '!$A$8:$E$24,5)))","v":""},{"$f":"UPPER(IF(($B17=0) + ($B17=\" \"),\"\",VLOOKUP($B17,'PRIPREMA '!$A$8:$G$24,6)))","v":""}," ","VS",{"$f":"S7","v":" "},{"$f":"UPPER(IF(($J17=0) + ($J17=\" \"),\"\",VLOOKUP($J17,'PRIPREMA '!$A$8:$C$24,2)))","v":""},{"$f":"UPPER(IF(($J17=0) + ($J17=\" \"),\"\",VLOOKUP($J17,'PRIPREMA '!$A$8:$C$24,3)))","v":""},{"$f":"UPPER(IF(($J17=0) + ($J17=\" \"),\"\",\"(\"&(VLOOKUP($J17,'PRIPREMA '!$A$8:$F$24,4)&\")\")))","v":""},null,{"$f":"UPPER(IF(($J17=0) + ($J17=\" \"),\"\",VLOOKUP($J17,'PRIPREMA '!$A$8:$F$24,6)))","v":""}," ",null," "," ",{"$f":"UPPER(IF(($R17=0)+($R17=\" \"),\"\",(VLOOKUP($R17,'PRIPREMA '!$A$8:$H$24,2)&\" \"&(VLOOKUP($R17,'PRIPREMA '!$A$8:$H$24,3)&\" (\"&(VLOOKUP($R17,'PRIPREMA '!$A$8:$H$24,4)&\")\")))))","v":""}]
["MEC 4",{"$f":"S5","v":" "},{"$f":"UPPER(IF(($B18=0) + ($B18=\" \"),\"\",VLOOKUP($B18,'PRIPREMA '!$A$8:$C$24,2)))","v":""},{"$f":"UPPER(IF(($B18=0) + ($B18=\" \"),\"\",VLOOKUP($B18,'PRIPREMA '!$A$8:$C$24,3)))","v":""},{"$f":"UPPER(IF(($B18=0) + ($B18=\" \"),\"\",\"(\"&(VLOOKUP($B18,'PRIPREMA '!$A$8:$E$24,4)&\")\")))","v":""},{"$f":"UPPER(IF(($B18=0) + ($B18=\" \"),\"\",VLOOKUP($B18,'PRIPREMA '!$A$8:$E$24,5)))","v":""},{"$f":"UPPER(IF(($B18=0) + ($B18=\" \"),\"\",VLOOKUP($B18,'PRIPREMA '!$A$8:$G$24,6)))","v":""}," ","VS",{"$f":"S10","v":" "},{"$f":"UPPER(IF(($J18=0) + ($J18=\" \"),\"\",VLOOKUP($J18,'PRIPREMA '!$A$8:$C$24,2)))","v":""},{"$f":"UPPER(IF(($J18=0) + ($J18=\" \"),\"\",VLOOKUP($J18,'PRIPREMA '!$A$8:$C$24,3)))","v":""},{"$f":"UPPER(IF(($J18=0) + ($J18=\" \"),\"\",\"(\"&(VLOOKUP($J18,'PRIPREMA '!$A$8:$F$24,4)&\")\")))","v":""},null,{"$f":"UPPER(IF(($J18=0) + ($J18=\" \"),\"\",VLOOKUP($J18,'PRIPREMA '!$A$8:$F$24,6)))","v":""}," ",null," "," ",{"$f":"UPPER(IF(($R18=0)+($R18=\" \"),\"\",(VLOOKUP($R18,'PRIPREMA '!$A$8:$H$24,2)&\" \"&(VLOOKUP($R18,'PRIPREMA '!$A$8:$H$24,3)&\" (\"&(VLOOKUP($R18,'PRIPREMA '!$A$8:$H$24,4)&\")\")))))","v":""}]
["MEC 5",{"$f":"S6","v":" "},{"$f":"UPPER(IF(($B19=0) + ($B19=\" \"),\"\",VLOOKUP($B19,'PRIPREMA '!$A$8:$C$24,2)))","v":""},{"$f":"UPPER(IF(($B19=0) + ($B19=\" \"),\"\",VLOOKUP($B19,'PRIPREMA '!$A$8:$C$24,3)))","v":""},{"$f":"UPPER(IF(($B19=0) + ($B19=\" \"),\"\",\"(\"&(VLOOKUP($B19,'PRIPREMA '!$A$8:$E$24,4)&\")\")))","v":""},{"$f":"UPPER(IF(($B19=0) + ($B19=\" \"),\"\",VLOOKUP($B19,'PRIPREMA '!$A$8:$E$24,5)))","v":""},{"$f":"UPPER(IF(($B19=0) + ($B19=\" \"),\"\",VLOOKUP($B19,'PRIPREMA '!$A$8:$G$24,6)))","v":""}," ","VS",{"$f":"S8","v":" "},{"$f":"UPPER(IF(($J19=0) + ($J19=\" \"),\"\",VLOOKUP($J19,'PRIPREMA '!$A$8:$C$24,2)))","v":""},{"$f":"UPPER(IF(($J19=0) + ($J19=\" \"),\"\",VLOOKUP($J19,'PRIPREMA '!$A$8:$C$24,3)))","v":""},{"$f":"UPPER(IF(($J19=0) + ($J19=\" \"),\"\",\"(\"&(VLOOKUP($J19,'PRIPREMA '!$A$8:$F$24,4)&\")\")))","v":""},null,{"$f":"UPPER(IF(($J19=0) + ($J19=\" \"),\"\",VLOOKUP($J19,'PRIPREMA '!$A$8:$F$24,6)))","v":""}," ",null," "," ",{"$f":"UPPER(IF(($R19=0)+($R19=\" \"),\"\",(VLOOKUP($R19,'PRIPREMA '!$A$8:$H$24,2)&\" \"&(VLOOKUP($R19,'PRIPREMA '!$A$8:$H$24,3)&\" (\"&(VLOOKUP($R19,'PRIPREMA '!$A$8:$H$24,4)&\")\")))))","v":""}]
[]
["KOLO 3"]
[null,null,"IGRAC  1",null,null,null,null,null,null,null,"IGRAC 2",null,null,null,null,null,"POBEDNIK\n1 ILI 2"]
[null,"sifra igrac1","PREZIME","IME","KLUB","DATUM ROĐENJA","TAKMIČARSKA LEGITIMACIJA",{"$f":"C23&\" \"&D23&\" (\"&E23&\")\"","v":"PREZIME IME (KLUB)"},null,"sifra igrac2","PREZIME","IME","KLUB","DATUM ROĐENJA","TAKMIČARSKA LEGITIMACIJA",{"$f":"K23&\" \"&L23&\" (\"&M23&\")\"","v":"PREZIME IME (KLUB)"},null,"sifra w","sifra L",null,"REZULTAT"]
["MEC 1",{"$f":"R15","v":" "},{"$f":"UPPER(IF(($B24=0) + ($B24=\" \"),\"\",VLOOKUP($B24,'PRIPREMA '!$A$8:$C$24,2)))","v":""},{"$f":"UPPER(IF(($B24=0) + ($B24=\" \"),\"\",VLOOKUP($B24,'PRIPREMA '!$A$8:$C$24,3)))","v":""},{"$f":"UPPER(IF(($B24=0) + ($B24=\" \"),\"\",\"(\"&(VLOOKUP($B24,'PRIPREMA '!$A$8:$E$24,4)&\")\")))","v":""},{"$f":"UPPER(IF(($B24=0) + ($B24=\" \"),\"\",VLOOKUP($B24,'PRIPREMA '!$A$8:$E$24,5)))","v":""},{"$f":"UPPER(IF(($B24=0) + ($B24=\" \"),\"\",VLOOKUP($B24,'PRIPREMA '!$A$8:$G$24,6)))","v":""},{"$f":"C24&\" \"&D24&E24","v":" "},"VS",{"$f":"R17","v":" "},{"$f":"UPPER(IF(($J24=0) + ($J24=\" \"),\"\",VLOOKUP($J24,'PRIPREMA '!$A$8:$C$24,2)))","v":""},{"$f":"UPPER(IF(($J24=0) + ($J24=\" \"),\"\",VLOOKUP($J24,'PRIPREMA '!$A$8:$C$24,3)))","v":""},{"$f":"UPPER(IF(($J24=0) + ($J24=\" \"),\"\",\"(\"&(VLOOKUP($J24,'PRIPREMA '!$A$8:$F$24,4)&\")\")))","v":""},null,{"$f":"UPPER(IF(($J24=0) + ($J24=\" \"),\"\",VLOOKUP($J24,'PRIPREMA '!$A$8:$F$24,6)))","v":""},{"$f":"K24&\" \"&L24&M24","v":" "},null,{"$f":"IF($Q24=1,$B24,IF($Q24=2,$J24,\" \"))","v":" "},{"$f":"IF($Q24=1,$J24,IF($Q24=2,$B24,\" \"))","v":" "},{"$f":"UPPER(IF(($R24=0)+($R24=\" \"),\"\",(VLOOKUP($R24,'PRIPREMA '!$A$8:$H$24,2)&\" \"&(VLOOKUP($R24,'PRIPREMA '!$A$8:$H$24,3)&\" (\"&(VLOOKUP($R24,'PRIPREMA '!$A$8:$H$24,4)&\")\")))))","v":""}]
["MEC 2",{"$f":"R16","v":" "},{"$f":"UPPER(IF(($B25=0) + ($B25=\" \"),\"\",VLOOKUP($B25,'PRIPREMA '!$A$8:$C$24,2)))","v":""},{"$f":"UPPER(IF(($B25=0) + ($B25=\" \"),\"\",VLOOKUP($B25,'PRIPREMA '!$A$8:$C$24,3)))","v":""},{"$f":"UPPER(IF(($B25=0) + ($B25=\" \"),\"\",\"(\"&(VLOOKUP($B25,'PRIPREMA '!$A$8:$E$24,4)&\")\")))","v":""},{"$f":"UPPER(IF(($B25=0) + ($B25=\" \"),\"\",VLOOKUP($B25,'PRIPREMA '!$A$8:$E$24,5)))","v":""},{"$f":"UPPER(IF(($B25=0) + ($B25=\" \"),\"\",VLOOKUP($B25,'PRIPREMA '!$A$8:$G$24,6)))","v":""}," ","VS",{"$f":"R18","v":" "},{"$f":"UPPER(IF(($J25=0) + ($J25=\" \"),\"\",VLOOKUP($J25,'PRIPREMA '!$A$8:$C$24,2)))","v":""},{"$f":"UPPER(IF(($J25=0) + ($J25=\" \"),\"\",VLOOKUP($J25,'PRIPREMA '!$A$8:$C$24,3)))","v":""},{"$f":"UPPER(IF(($J25=0) + ($J25=\" \"),\"\",\"(\"&(VLOOKUP($J25,'PRIPREMA '!$A$8:$F$24,4)&\")\")))","v":""},null,{"$f":"UPPER(IF(($J25=0) + ($J25=\" \"),\"\",VLOOKUP($J25,'PRIPREMA '!$A$8:$F$24,6)))","v":""}," ",null," "," ",{"$f":"UPPER(IF(($R25=0)+($R25=\" \"),\"\",(VLOOKUP($R25,'PRIPREMA '!$A$8:$H$24,2)&\" \"&(VLOOKUP($R25,'PRIPREMA '!$A$8:$H$24,3)&\" (\"&(VLOOKUP($R25,'PRIPREMA '!$A$8:$H$24,4)&\")\")))))","v":""}]
["MEC 3",{"$f":"R19","v":" "},{"$f":"UPPER(IF(($B26=0) + ($B26=\" \"),\"\",VLOOKUP($B26,'PRIPREMA '!$A$8:$C$24,2)))","v":""},{"$f":"UPPER(IF(($B26=0) + ($B26=\" \"),\"\",VLOOKUP($B26,'PRIPREMA '!$A$8:$C$24,3)))","v":""},{"$f":"UPPER(IF(($B26=0) + ($B26=\" \"),\"\",\"(\"&(VLOOKUP($B26,'PRIPREMA '!$A$8:$E$24,4)&\")\")))","v":""},{"$f":"UPPER(IF(($B26=0) + ($B26=\" \"),\"\",VLOOKUP($B26,'PRIPREMA '!$A$8:$E$24,5)))","v":""},{"$f":"UPPER(IF(($B26=0) + ($B26=\" \"),\"\",VLOOKUP($B26,'PRIPREMA '!$A$8:$G$24,6)))","v":""}," ","VS",{"$f":"S17","v":" "},{"$f":"UPPER(IF(($J26=0) + ($J26=\" \"),\"\",VLOOKUP($J26,'PRIPREMA '!$A$8:$C$24,2)))","v":""},{"$f":"UPPER(IF(($J26=0) + ($J26=\" \"),\"\",VLOOKUP($J26,'PRIPREMA '!$A$8:$C$24,3)))","v":""},{"$f":"UPPER(IF(($J26=0) + ($J26=\" \"),\"\",\"(\"&(VLOOKUP($J26,'PRIPREMA '!$A$8:$F$24,4)&\")\")))","v":""},null,{"$f":"UPPER(IF(($J26=0) + ($J26=\" \"),\"\",VLOOKUP($J26,'PRIPREMA '!$A$8:$F$24,6)))","v":""}," ",null," "," ",{"$f":"UPPER(IF(($R26=0)+($R26=\" \"),\"\",(VLOOKUP($R26,'PRIPREMA '!$A$8:$H$24,2)&\" \"&(VLOOKUP($R26,'PRIPREMA '!$A$8:$H$24,3)&\" (\"&(VLOOKUP($R26,'PRIPREMA '!$A$8:$H$24,4)&\")\")))))","v":""}]
["MEC 4",{"$f":"S15","v":" "},{"$f":"UPPER(IF(($B27=0) + ($B27=\" \"),\"\",VLOOKUP($B27,'PRIPREMA '!$A$8:$C$24,2)))","v":""},{"$f":"UPPER(IF(($B27=0) + ($B27=\" \"),\"\",VLOOKUP($B27,'PRIPREMA '!$A$8:$C$24,3)))","v":""},{"$f":"UPPER(IF(($B27=0) + ($B27=\" \"),\"\",\"(\"&(VLOOKUP($B27,'PRIPREMA '!$A$8:$E$24,4)&\")\")))","v":""},{"$f":"UPPER(IF(($B27=0) + ($B27=\" \"),\"\",VLOOKUP($B27,'PRIPREMA '!$A$8:$E$24,5)))","v":""},{"$f":"UPPER(IF(($B27=0) + ($B27=\" \"),\"\",VLOOKUP($B27,'PRIPREMA '!$A$8:$G$24,6)))","v":""}," ","VS",{"$f":"S16","v":" "},{"$f":"UPPER(IF(($J27=0) + ($J27=\" \"),\"\",VLOOKUP($J27,'PRIPREMA '!$A$8:$C$24,2)))","v":""},{"$f":"UPPER(IF(($J27=0) + ($J27=\" \"),\"\",VLOOKUP($J27,'PRIPREMA '!$A$8:$C$24,3)))","v":""},{"$f":"UPPER(IF(($J27=0) + ($J27=\" \"),\"\",\"(\"&(VLOOKUP($J27,'PRIPREMA '!$A$8:$F$24,4)&\")\")))","v":""},null,{"$f":"UPPER(IF(($J27=0) + ($J27=\" \"),\"\",VLOOKUP($J27,'PRIPREMA '!$A$8:$F$24,6)))","v":""}," ",null," "," ",{"$f":"UPPER(IF(($R27=0)+($R27=\" \"),\"\",(VLOOKUP($R27,'PRIPREMA '!$A$8:$H$24,2)&\" \"&(VLOOKUP($R27,'PRIPREMA '!$A$8:$H$24,3)&\" (\"&(VLOOKUP($R27,'PRIPREMA '!$A$8:$H$24,4)&\")\")))))","v":""}]
["MEC 5",{"$f":"S18","v":" "},{"$f":"UPPER(IF(($B28=0) + ($B28=\" \"),\"\",VLOOKUP($B28,'PRIPREMA '!$A$8:$C$24,2)))","v":""},{"$f":"UPPER(IF(($B28=0) + ($B28=\" \"),\"\",VLOOKUP($B28,'PRIPREMA '!$A$8:$C$24,3)))","v":""},{"$f":"UPPER(IF(($B28=0) + ($B28=\" \"),\"\",\"(\"&(VLOOKUP($B28,'PRIPREMA '!$A$8:$E$24,4)&\")\")))","v":""},{"$f":"UPPER(IF(($B28=0) + ($B28=\" \"),\"\",VLOOKUP($B28,'PRIPREMA '!$A$8:$E$24,5)))","v":""},{"$f":"UPPER(IF(($B28=0) + ($B28=\" \"),\"\",VLOOKUP($B28,'PRIPREMA '!$A$8:$G$24,6)))","v":""}," ","VS",{"$f":"S19","v":" "},{"$f":"UPPER(IF(($J28=0) + ($J28=\" \"),\"\",VLOOKUP($J28,'PRIPREMA '!$A$8:$C$24,2)))","v":""},{"$f":"UPPER(IF(($J28=0) + ($J28=\" \"),\"\",VLOOKUP($J28,'PRIPREMA '!$A$8:$C$24,3)))","v":""},{"$f":"UPPER(IF(($J28=0) + ($J28=\" \"),\"\",\"(\"&(VLOOKUP($J28,'PRIPREMA '!$A$8:$F$24,4)&\")\")))","v":""},null,{"$f":"UPPER(IF(($J28=0) + ($J28=\" \"),\"\",VLOOKUP($J28,'PRIPREMA '!$A$8:$F$24,6)))","v":""}," ",null," "," ",{"$f":"UPPER(IF(($R28=0)+($R28=\" \"),\"\",(VLOOKUP($R28,'PRIPREMA '!$A$8:$H$24,2)&\" \"&(VLOOKUP($R28,'PRIPREMA '!$A$8:$H$24,3)&\" (\"&(VLOOKUP($R28,'PRIPREMA '!$A$8:$H$24,4)&\")\")))))","v":""}]
[]
["KOLO 4"]
[null,null,"IGRAC  1",null,null,null,null,null,null,null,"IGRAC 2",null,null,null,null,null,"POBEDNIK\n1 ILI 2"]
[null,"sifra igrac1","PREZIME","IME","KLUB","DATUM ROĐENJA","TAKMIČARSKA LEGITIMACIJA",{"$f":"C32&\" \"&D32&\" (\"&E32&\")\"","v":"PREZIME IME (KLUB)"},null,"sifra igrac2","PREZIME","IME","KLUB","DATUM ROĐENJA","TAKMIČARSKA LEGITIMACIJA",{"$f":"K32&\" \"&L32&\" (\"&M32&\")\"","v":"PREZIME IME (KLUB)"},null,"sifra w","sifra L",null,"REZULTAT"]
["MEC 1",{"$f":"IF($Q$24=\"\",\" \",IF($Q$24=1,R15,IF($Q$24=2,IF($Q$17=1,R16,R15))))","v":" "},{"$f":"UPPER(IF(($B33=0) + ($B33=\" \"),\"\",VLOOKUP($B33,'PRIPREMA '!$A$8:$C$24,2)))","v":""},{"$f":"UPPER(IF(($B33=0) + ($B33=\" \"),\"\",VLOOKUP($B33,'PRIPREMA '!$A$8:$C$24,3)))","v":""},{"$f":"UPPER(IF(($B33=0) + ($B33=\" \"),\"\",\"(\"&(VLOOKUP($B33,'PRIPREMA '!$A$8:$E$24,4)&\")\")))","v":""},{"$f":"UPPER(IF(($B33=0) + ($B33=\" \"),\"\",VLOOKUP($B33,'PRIPREMA '!$A$8:$E$24,5)))","v":""},{"$f":"UPPER(IF(($B33=0) + ($B33=\" \"),\"\",VLOOKUP($B33,'PRIPREMA '!$A$8:$G$24,6)))","v":""},{"$f":"C33&\" \"&D33&E33","v":" "},"VS",{"$f":"IF($Q$24=\"\",\" \",IF($Q$24=1,R16,IF($Q$24=2,IF($Q$17=1,R17,R16))))","v":" "},{"$f":"UPPER(IF(($J33=0) + ($J33=\" \"),\"\",VLOOKUP($J33,'PRIPREMA '!$A$8:$C$24,2)))","v":""},{"$f":"UPPER(IF(($J33=0) + ($J33=\" \"),\"\",VLOOKUP($J33,'PRIPREMA '!$A$8:$C$24,3)))","v":""},{"$f":"UPPER(IF(($J33=0) + ($J33=\" \"),\"\",\"(\"&(VLOOKUP($J33,'PRIPREMA '!$A$8:$F$24,4)&\")\")))","v":""},null,{"$f":"UPPER(IF(($J33=0) + ($J33=\" \"),\"\",VLOOKUP($J33,'PRIPREMA '!$A$8:$F$24,6)))","v":""},{"$f":"K33&\" \"&L33&M33","v":" "},null,{"$f":"IF($Q33=1,$B33,IF($Q33=2,$J33,\" \"))","v":" "},{"$f":"IF($Q33=1,$J33,IF($Q33=2,$B33,\" \"))","v":" "},{"$f":"UPPER(IF(($R33=0)+($R33=\" \"),\"\",(VLOOKUP($R33,'PRIPREMA '!$A$8:$H$24,2)&\" \"&(VLOOKUP($R33,'PRIPREMA '!$A$8:$H$24,3)&\" (\"&(VLOOKUP($R33,'PRIPREMA '!$A$8:$H$24,4)&\")\")))))","v":""}]
["MEC 2",{"$f":"IF($Q$24=\"\",\" \",IF($Q$24=1,R17,IF($Q$24=2,IF($Q$17=1,R15,R17))))","v":" "},{"$f":"UPPER(IF(($B34=0) + ($B34=\" \"),\"\",VLOOKUP($B34,'PRIPREMA '!$A$8:$C$24,2)))","v":""},{"$f":"UPPER(IF(($B34=0) + ($B34=\" \"),\"\",VLOOKUP($B34,'PRIPREMA '!$A$8:$C$24,3)))","v":""},{"$f":"UPPER(IF(($B34=0) + ($B34=\" \"),\"\",\"(\"&(VLOOKUP($B34,'PRIPREMA '!$A$8:$E$24,4)&\")\")))","v":""},{"$f":"UPPER(IF(($B34=0) + ($B34=\" \"),\"\",VLOOKUP($B34,'PRIPREMA '!$A$8:$E$24,5)))","v":""},{"$f":"UPPER(IF(($B34=0) + ($B34=\" \"),\"\",VLOOKUP($B34,'PRIPREMA '!$A$8:$G$24,6)))","v":""}," ","VS",{"$f":"IF($Q$24=\"\",\" \",IF($Q$24=1,S15,IF($Q$24=2,IF($Q$17=1,S16,S15))))","v":" "},{"$f":"UPPER(IF(($J34=0) + ($J34=\" \"),\"\",VLOOKUP($J34,'PRIPREMA '!$A$8:$C$24,2)))","v":""},{"$f":"UPPER(IF(($J34=0) + ($J34=\" \"),\"\",VLOOKUP($J34,'PRIPREMA '!$A$8:$C$24,3)))","v":""},{"$f":"UPPER(IF(($J34=0) + ($J34=\" \"),\"\",\"(\"&(VLOOKUP($J34,'PRIPREMA '!$A$8:$F$24,4)&\")\")))","v":""},null,{"$f":"UPPER(IF(($J34=0) + ($J34=\" \"),\"\",VLOOKUP($J34,'PRIPREMA '!$A$8:$F$24,6)))","v":""}," ",null," "," ",{"$f":"UPPER(IF(($R34=0)+($R34=\" \"),\"\",(VLOOKUP($R34,'PRIPREMA '!$A$8:$H$24,2)&\" \"&(VLOOKUP($R34,'PRIPREMA '!$A$8:$H$24,3)&\" (\"&(VLOOKUP($R34,'PRIPREMA '!$A$8:$H$24,4)&\")\")))))","v":""}]
["MEC 3",{"$f":"IF($Q$24=\"\",\" \",IF($Q$24=1,R18,IF($Q$24=2,IF($Q$17=1,S15,R18))))","v":" "},{"$f":"UPPER(IF(($B35=0) + ($B35=\" \"),\"\",VLOOKUP($B35,'PRIPREMA '!$A$8:$C$24,2)))","v":""},{"$f":"UPPER(IF(($B35=0) + ($B35=\" \"),\"\",VLOOKUP($B35,'PRIPREMA '!$A$8:$C$24,3)))","v":""},{"$f":"UPPER(IF(($B35=0) + ($B35=\" \"),\"\",\"(\"&(VLOOKUP($B35,'PRIPREMA '!$A$8:$E$24,4)&\")\")))","v":""},{"$f":"UPPER(IF(($B35=0) + ($B35=\" \"),\"\",VLOOKUP($B35,'PRIPREMA '!$A$8:$E$24,5)))","v":""},{"$f":"UPPER(IF(($B35=0) + ($B35=\" \"),\"\",VLOOKUP($B35,'PRIPREMA '!$A$8:$G$24,6)))","v":""}," ","VS",{"$f":"IF($Q$24=\"\",\" \",IF($Q$24=1,R19,IF($Q$24=2,IF($Q$17=1,S17,R19))))","v":" "},{"$f":"UPPER(IF(($J35=0) + ($J35=\" \"),\"\",VLOOKUP($J35,'PRIPREMA '!$A$8:$C$24,2)))","v":""},{"$f":"UPPER(IF(($J35=0) + ($J35=\" \"),\"\",VLOOKUP($J35,'PRIPREMA '!$A$8:$C$24,3)))","v":""},{"$f":"UPPER(IF(($J35=0) + ($J35=\" \"),\"\",\"(\"&(VLOOKUP($J35,'PRIPREMA '!$A$8:$F$24,4)&\")\")))","v":""},null,{"$f":"UPPER(IF(($J35=0) + ($J35=\" \"),\"\",VLOOKUP($J35,'PRIPREMA '!$A$8:$F$24,6)))","v":""}," ",null," "," ",{"$f":"UPPER(IF(($R35=0)+($R35=\" \"),\"\",(VLOOKUP($R35,'PRIPREMA '!$A$8:$H$24,2)&\" \"&(VLOOKUP($R35,'PRIPREMA '!$A$8:$H$24,3)&\" (\"&(VLOOKUP($R35,'PRIPREMA '!$A$8:$H$24,4)&\")\")))))","v":""}]
["MEC 4",{"$f":"IF($Q$24=\"\",\" \",IF($Q$24=1,S16,IF($Q$24=2,IF($Q$17=1,S19,S16))))","v":" "},{"$f":"UPPER(IF(($B36=0) + ($B36=\" \"),\"\",VLOOKUP($B36,'PRIPREMA '!$A$8:$C$24,2)))","v":""},{"$f":"UPPER(IF(($B36=0) + ($B36=\" \"),\"\",VLOOKUP($B36,'PRIPREMA '!$A$8:$C$24,3)))","v":""},{"$f":"UPPER(IF(($B36=0) + ($B36=\" \"),\"\",\"(\"&(VLOOKUP($B36,'PRIPREMA '!$A$8:$E$24,4)&\")\")))","v":""},{"$f":"UPPER(IF(($B36=0) + ($B36=\" \"),\"\",VLOOKUP($B36,'PRIPREMA '!$A$8:$E$24,5)))","v":""},{"$f":"UPPER(IF(($B36=0) + ($B36=\" \"),\"\",VLOOKUP($B36,'PRIPREMA '!$A$8:$G$24,6)))","v":""}," ","VS",{"$f":"IF($Q$24=\"\",\" \",IF($Q$24=1,S18,IF($Q$24=2,IF($Q$17=1,R18,S18))))","v":" "},{"$f":"UPPER(IF(($J36=0) + ($J36=\" \"),\"\",VLOOKUP($J36,'PRIPREMA '!$A$8:$C$24,2)))","v":""},{"$f":"UPPER(IF(($J36=0) + ($J36=\" \"),\"\",VLOOKUP($J36,'PRIPREMA '!$A$8:$C$24,3)))","v":""},{"$f":"UPPER(IF(($J36=0) + ($J36=\" \"),\"\",\"(\"&(VLOOKUP($J36,'PRIPREMA '!$A$8:$F$24,4)&\")\")))","v":""},null,{"$f":"UPPER(IF(($J36=0) + ($J36=\" \"),\"\",VLOOKUP($J36,'PRIPREMA '!$A$8:$F$24,6)))","v":""}," ",null," "," ",{"$f":"UPPER(IF(($R36=0)+($R36=\" \"),\"\",(VLOOKUP($R36,'PRIPREMA '!$A$8:$H$24,2)&\" \"&(VLOOKUP($R36,'PRIPREMA '!$A$8:$H$24,3)&\" (\"&(VLOOKUP($R36,'PRIPREMA '!$A$8:$H$24,4)&\")\")))))","v":""}]
["MEC 5",{"$f":"IF($Q$24=\"\",\" \",IF($Q$24=1,S19,IF($Q$24=2,IF($Q$17=1,R19,S19))))","v":" "},{"$f":"UPPER(IF(($B37=0) + ($B37=\" \"),\"\",VLOOKUP($B37,'PRIPREMA '!$A$8:$C$24,2)))","v":""},{"$f":"UPPER(IF(($B37=0) + ($B37=\" \"),\"\",VLOOKUP($B37,'PRIPREMA '!$A$8:$C$24,3)))","v":""},{"$f":"UPPER(IF(($B37=0) + ($B37=\" \"),\"\",\"(\"&(VLOOKUP($B37,'PRIPREMA '!$A$8:$E$24,4)&\")\")))","v":""},{"$f":"UPPER(IF(($B37=0) + ($B37=\" \"),\"\",VLOOKUP($B37,'PRIPREMA '!$A$8:$E$24,5)))","v":""},{"$f":"UPPER(IF(($B37=0) + ($B37=\" \"),\"\",VLOOKUP($B37,'PRIPREMA '!$A$8:$G$24,6)))","v":""}," ","VS",{"$f":"IF($Q$24=\"\",\" \",IF($Q$24=1,S17,IF($Q$24=2,IF($Q$17=1,S18,S17))))","v":" "},{"$f":"UPPER(IF(($J37=0) + ($J37=\" \"),\"\",VLOOKUP($J37,'PRIPREMA '!$A$8:$C$24,2)))","v":""},{"$f":"UPPER(IF(($J37=0) + ($J37=\" \"),\"\",VLOOKUP($J37,'PRIPREMA '!$A$8:$C$24,3)))","v":""},{"$f":"UPPER(IF(($J37=0) + ($J37=\" \"),\"\",\"(\"&(VLOOKUP($J37,'PRIPREMA '!$A$8:$F$24,4)&\")\")))","v":""},null,{"$f":"UPPER(IF(($J37=0) + ($J37=\" \"),\"\",VLOOKUP($J37,'PRIPREMA '!$A$8:$F$24,6)))","v":""}," ",null," "," ",{"$f":"UPPER(IF(($R37=0)+($R37=\" \"),\"\",(VLOOKUP($R37,'PRIPREMA '!$A$8:$H$24,2)&\" \"&(VLOOKUP($R37,'PRIPREMA '!$A$8:$H$24,3)&\" (\"&(VLOOKUP($R37,'PRIPREMA '!$A$8:$H$24,4)&\")\")))))","v":""}]

{"sheet":"TABELA 10","index":5,"n_rows":20,"n_cols":6,"rows_kept":20,"cut":false,"hidden":false,"merged":[]}
[]
[]
[]
[null,null,"Pozicija","Prezime ","Ime","Bodovi"]
[null,null,1,{"$f":"'RADNI 10'!J4","v":"Ristic"},{"$f":"'RADNI 10'!K4","v":"Ognjen"},{"$f":"'RADNI 10'!L4","v":0}]
[null,null,2,{"$f":"'RADNI 10'!J5","v":"Mladenovic"},{"$f":"'RADNI 10'!K5","v":"Janko"},{"$f":"'RADNI 10'!L5","v":0}]
[null,null,3,{"$f":"'RADNI 10'!J6","v":"Aleksic"},{"$f":"'RADNI 10'!K6","v":"Jovan"},{"$f":"'RADNI 10'!L6","v":0}]
[null,null,4,{"$f":"'RADNI 10'!J7","v":"Djordjevic "},{"$f":"'RADNI 10'!K7","v":"Veljko"},{"$f":"'RADNI 10'!L7","v":0}]
[null,null,5,{"$f":"'RADNI 10'!J8","v":"Stanimirovic"},{"$f":"'RADNI 10'!K8","v":"Rastko"},{"$f":"'RADNI 10'!L8","v":0}]
[null,null,6,{"$f":"'RADNI 10'!J9","v":"Milic"},{"$f":"'RADNI 10'!K9","v":"Milos"},{"$f":"'RADNI 10'!L9","v":0}]
[null,null,7,{"$f":"'RADNI 10'!J10","v":"Ognjanovic"},{"$f":"'RADNI 10'!K10","v":"Sava"},{"$f":"'RADNI 10'!L10","v":0}]
[null,null,8,{"$f":"'RADNI 10'!J11","v":"Stanimirovic"},{"$f":"'RADNI 10'!K11","v":"Vukan"},{"$f":"'RADNI 10'!L11","v":0}]
[null,null,9,{"$f":"'RADNI 10'!J12","v":"Stepanovic"},{"$f":"'RADNI 10'!K12","v":"Novak"},{"$f":"'RADNI 10'!L12","v":0}]
[null,null,10,{"$f":"'RADNI 10'!J13","v":"Jovanovic"},{"$f":"'RADNI 10'!K13","v":"Filip"},{"$f":"'RADNI 10'!L13","v":0}]
[null,null,11,{"$f":"'RADNI 10'!J14","v":0},{"$f":"'RADNI 10'!K14","v":0},{"$f":"'RADNI 10'!L14","v":0}]
[null,null,12,{"$f":"'RADNI 10'!J15","v":0},{"$f":"'RADNI 10'!K15","v":0},{"$f":"'RADNI 10'!L15","v":0}]
[null,null,13,{"$f":"'RADNI 10'!J16","v":0},{"$f":"'RADNI 10'!K16","v":0},{"$f":"'RADNI 10'!L16","v":0}]
[null,null,14,{"$f":"'RADNI 10'!J17","v":0},{"$f":"'RADNI 10'!K17","v":0},{"$f":"'RADNI 10'!L17","v":0}]
[null,null,15,{"$f":"'RADNI 10'!J18","v":0},{"$f":"'RADNI 10'!K18","v":0},{"$f":"'RADNI 10'!L18","v":0}]
[null,null,16,{"$f":"'RADNI 10'!J19","v":0},{"$f":"'RADNI 10'!K19","v":0},{"$f":"'RADNI 10'!L19","v":0}]

{"sheet":"RADNI 10","index":6,"n_rows":24,"n_cols":17,"rows_kept":24,"cut":false,"hidden":true,"merged":[]}
[]
[null,null,"BODOVI",15]
[null,null,"rang","Pozicija","Prezime ","Ime","Bodovi",null,"Pozicija","Prezime ","Ime","Bodovi"]
[null,{"$f":"RANK($G4,$G$4:$G$23)+SUMPRODUCT(--($C4>$C$4:$C$23),--($G$4:$G$23=$G4))","v":{"$error":"#N/A"}},10,{"$f":"RANK($G4,$G$4:$G$23)+SUMPRODUCT(--($C4>$C$4:$C$23),--($G$4:$G$23=$G4))","v":{"$error":"#N/A"}},null,null,null,null,1,{"$f":"IFERROR(VLOOKUP($I4,$M$4:$P$19,2,FALSE),VLOOKUP($I4,$M$4:$P$19,2,TRUE))","v":"Ristic"},{"$f":"IFERROR(VLOOKUP($I4,$M$4:$P$19,3,FALSE),VLOOKUP($I4,$M$4:$P$19,3,TRUE))","v":"Ognjen"},{"$f":"IFERROR(VLOOKUP($I4,$M$4:$P$19,4,FALSE),VLOOKUP($I4,$M$4:$P$19,4,TRUE))","v":0},{"$f":"RANK($P4,$P$4:$P$19)+SUMPRODUCT(--($C4>$C$4:$C$19),--($P$4:$P$19=$P4))","v":1},{"$f":"'PRIPREMA '!$B8","v":"Ristic"},{"$f":"'PRIPREMA '!$C8","v":"Ognjen"},{"$f":"Q4*$D$2","v":0},{"$f":"COUNTIFS('Zreb CEO 10'!R:R,'PRIPREMA '!A8)","v":0}]
[null,{"$f":"RANK(G5,$G$4:$G$23)+SUMPRODUCT(--(C5>$C$4:$C$23),--($G$4:$G$23=G5))","v":{"$error":"#N/A"}},11,{"$error":"#N/A"},null,null,null,null,2,{"$f":"IFERROR(VLOOKUP($I5,$M$4:$P$19,2,FALSE),VLOOKUP($I5,$M$4:$P$19,2,TRUE))","v":"Mladenovic"},{"$f":"IFERROR(VLOOKUP($I5,$M$4:$P$19,3,FALSE),VLOOKUP($I5,$M$4:$P$19,3,TRUE))","v":"Janko"},{"$f":"IFERROR(VLOOKUP($I5,$M$4:$P$19,4,FALSE),VLOOKUP($I5,$M$4:$P$19,4,TRUE))","v":0},{"$f":"RANK($P5,$P$4:$P$19)+SUMPRODUCT(--($C5>$C$4:$C$19),--($P$4:$P$19=$P5))","v":2},{"$f":"'PRIPREMA '!$B9","v":"Mladenovic"},{"$f":"'PRIPREMA '!$C9","v":"Janko"},{"$f":"Q5*$D$2","v":0},{"$f":"COUNTIFS('Zreb CEO 10'!R:R,'PRIPREMA '!A9)","v":0}]
[null,{"$error":"#N/A"},12,{"$error":"#N/A"},null,null,null,null,3,"Aleksic","Jovan",0,3,{"$f":"'PRIPREMA '!$B10","v":"Aleksic"},{"$f":"'PRIPREMA '!$C10","v":"Jovan"},0,{"$f":"COUNTIFS('Zreb CEO 10'!R:R,'PRIPREMA '!A10)","v":0}]
[null,{"$error":"#N/A"},13,{"$error":"#N/A"},null,null,null,null,4,"Djordjevic ","Veljko",0,4,{"$f":"'PRIPREMA '!$B11","v":"Djordjevic "},{"$f":"'PRIPREMA '!$C11","v":"Veljko"},0,{"$f":"COUNTIFS('Zreb CEO 10'!R:R,'PRIPREMA '!A11)","v":0}]
[null,{"$error":"#N/A"},14,{"$error":"#N/A"},null,null,null,null,5,"Stanimirovic","Rastko",0,5,{"$f":"'PRIPREMA '!$B12","v":"Stanimirovic"},{"$f":"'PRIPREMA '!$C12","v":"Rastko"},0,{"$f":"COUNTIFS('Zreb CEO 10'!R:R,'PRIPREMA '!A12)","v":0}]
[null,{"$error":"#N/A"},15,{"$error":"#N/A"},null,null,null,null,6,"Milic","Milos",0,6,{"$f":"'PRIPREMA '!$B13","v":"Milic"},{"$f":"'PRIPREMA '!$C13","v":"Milos"},0,{"$f":"COUNTIFS('Zreb CEO 10'!R:R,'PRIPREMA '!A13)","v":0}]
[null,{"$error":"#N/A"},16,{"$error":"#N/A"},null,null,null,null,7,"Ognjanovic","Sava",0,7,{"$f":"'PRIPREMA '!$B14","v":"Ognjanovic"},{"$f":"'PRIPREMA '!$C14","v":"Sava"},0,{"$f":"COUNTIFS('Zreb CEO 10'!R:R,'PRIPREMA '!A14)","v":0}]
[null,{"$error":"#N/A"},17,{"$error":"#N/A"},null,null,null,null,8,"Stanimirovic","Vukan",0,8,{"$f":"'PRIPREMA '!$B15","v":"Stanimirovic"},{"$f":"'PRIPREMA '!$C15","v":"Vukan"},0,{"$f":"COUNTIFS('Zreb CEO 10'!R:R,'PRIPREMA '!A15)","v":0}]
[null,{"$error":"#N/A"},18,{"$error":"#N/A"},null,null,null,null,9,"Stepanovic","Novak",0,9,{"$f":"'PRIPREMA '!$B16","v":"Stepanovic"},{"$f":"'PRIPREMA '!$C16","v":"Novak"},0,{"$f":"COUNTIFS('Zreb CEO 10'!R:R,'PRIPREMA '!A16)","v":0}]
[null,{"$error":"#N/A"},19,{"$error":"#N/A"},null,null,null,null,10,"Jovanovic","Filip",0,10,{"$f":"'PRIPREMA '!$B18","v":"Jovanovic"},{"$f":"'PRIPREMA '!$C18","v":"Filip"},0,{"$f":"COUNTIFS('Zreb CEO 10'!R:R,'PRIPREMA '!A18)","v":0}]
[null,{"$error":"#N/A"},20,{"$error":"#N/A"},null,null,null,null,11,0,0,0,11,{"$f":"'PRIPREMA '!$B19","v":0},{"$f":"'PRIPREMA '!$C19","v":0},0,{"$f":"COUNTIFS('Zreb CEO 10'!R:R,'PRIPREMA '!A19)","v":0}]
[null,{"$error":"#N/A"},21,{"$error":"#N/A"},null,null,null,null,12,0,0,0,12,{"$f":"'PRIPREMA '!$B20","v":0},{"$f":"'PRIPREMA '!$C20","v":0},0,{"$f":"COUNTIFS('Zreb CEO 10'!R:R,'PRIPREMA '!A20)","v":0}]
[null,{"$error":"#N/A"},22,{"$error":"#N/A"},null,null,null,null,13,0,0,0,13,{"$f":"'PRIPREMA '!$B21","v":0},{"$f":"'PRIPREMA '!$C21","v":0},0,{"$f":"COUNTIFS('Zreb CEO 10'!R:R,'PRIPREMA '!A21)","v":0}]
[null,{"$error":"#N/A"},23,{"$error":"#N/A"},null,null,null,null,14,0,0,0,14,{"$f":"'PRIPREMA '!$B22","v":0},{"$f":"'PRIPREMA '!$C22","v":0},0,{"$f":"COUNTIFS('Zreb CEO 10'!R:R,'PRIPREMA '!A22)","v":0}]
[null,{"$error":"#N/A"},24,{"$error":"#N/A"},null,null,null,null,15,0,0,0,15,{"$f":"'PRIPREMA '!$B23","v":0},{"$f":"'PRIPREMA '!$C23","v":0},0,{"$f":"COUNTIFS('Zreb CEO 10'!R:R,'PRIPREMA '!A23)","v":0}]
[null,{"$error":"#N/A"},25,{"$error":"#N/A"},null,null,null,null,16,0,0,0,16,{"$f":"'PRIPREMA '!$B24","v":0},{"$f":"'PRIPREMA '!$C24","v":0},0,{"$f":"COUNTIFS('Zreb CEO 10'!R:R,'PRIPREMA '!A24)","v":0}]
[null,{"$error":"#N/A"},26,{"$error":"#N/A"},null,null,null,null,17]
[null,{"$error":"#N/A"},27,{"$error":"#N/A"},null,null,null,null,18]
[null,{"$error":"#N/A"},28,{"$error":"#N/A"},null,null,null,null,19]
[null,{"$error":"#N/A"},29,{"$error":"#N/A"},null,null,null,null,20]
[null,null,null,null,null,null,null,null,null,{"$f":"IFERROR(VLOOKUP($I24,$D$4:$G$23,2,FALSE),VLOOKUP($I24,$D$4:$G$23,2,TRUE))","v":{"$error":"#N/A"}}]

{"sheet":"RASPORED ZREB 10","index":7,"n_rows":474,"n_cols":32,"rows_kept":474,"cut":false,"hidden":false,"merged":[[69,5,69,9],[69,10,69,14],[70,5,70,9],[70,10,70,14],[72,10,73,11],[72,12,73,14],[66,5,66,9],[66,10,66,14],[67,6,67,8],[67,11,67,13],[68,5,68,9],[68,10,68,14],[63,5,63,9],[63,10,63,14],[64,5,64,9],[64,10,64,14],[65,5,65,9],[65,10,65,14],[60,5,60,9],[60,10,60,14],[61,5,61,9],[61,10,61,14],[62,5,62,9],[62,10,62,14],[57,5,57,9],[57,10,57,14],[58,5,58,9],[58,10,58,14],[59,6,59,8],[59,11,59,13],[54,5,54,9],[54,10,54,14],[55,5,55,9],[55,10,55,14],[56,5,56,9],[56,10,56,14],[51,6,51,8],[51,11,51,13],[52,5,52,9],[52,10,52,14],[53,5,53,9],[53,10,53,14],[48,5,48,9],[48,10,48,14],[49,5,49,9],[49,10,49,14],[50,5,50,9],[50,10,50,14],[45,5,45,9],[45,10,45,14],[46,5,46,9],[46,10,46,14],[47,5,47,9],[47,10,47,14],[42,5,42,9],[42,10,42,14],[43,6,43,8],[43,11,43,13],[44,5,44,9],[44,10,44,14],[39,5,39,9],[39,10,39,14],[40,5,40,9],[40,10,40,14],[41,5,41,9],[41,10,41,14],[36,5,36,9],[36,10,36,14],[37,5,37,9],[37,10,37,14],[38,5,38,9],[38,10,38,14],[33,5,33,9],[33,10,33,14],[34,5,34,9],[34,10,34,14],[35,6,35,8],[35,11,35,13],[30,5,30,9],[30,10,30,14],[31,5,31,9],[31,10,31,14],[32,5,32,9],[32,10,32,14],[27,6,27,8],[27,11,27,13],[28,5,28,9],[28,10,28,14],[29,5,29,9],[29,10,29,14],[24,5,24,9],[24,10,24,14],[25,5,25,9],[25,10,25,14],[26,5,26,9],[26,10,26,14],[21,5,21,9],[21,10,21,14],[22,5,22,9],[22,10,22,14],[23,5,23,9],[23,10,23,14],[18,5,18,9],[18,10,18,14],[19,6,19,8],[19,11,19,13],[20,5,20,9],[20,10,20,14],[15,5,15,9],[15,10,15,14],[16,5,16,9],[16,10,16,14],[17,5,17,9],[17,10,17,14],[12,5,12,9],[12,10,12,14],[13,5,13,9],[13,10,13,14],[14,5,14,9],[14,10,14,14],[10,5,10,9],[10,10,10,14],[11,6,11,8],[11,11,11,13],[6,5,6,9],[6,10,6,14],[7,5,7,9],[7,10,7,14],[8,5,8,9],[8,10,8,14],[1,4,2,7],[1,8,1,11],[2,8,3,11],[4,6,4,7],[4,8,4,9],[5,6,5,7],[5,8,5,9],[9,5,9,9],[9,10,9,14]]}
[]
[null,null,null,null,null,null,null,null,"DAN, DATUM"]
[]
[null,null,null,null,{"$f":"'[1]PODEŠAVANJA-NE BRISATI'!$A$8","v":"Teniski savez Srbije"}]
[null,null,null,null,"DATUM",null,"GRAD, KLUB",null,"KATEGORIJA",null,null,"KONKURENCIJA",null,null,"VRHOVNI SUDIJA"]
[]
[null,null,null,null,null,"TEREN 1",null,null,null,null,"TEREN 2"]
[null,null,null,null,null,"POČETAK U: 10H",null,null,null,null,"POČETAK U: 10H"]
[null,null,null,null,"1. MEC",{"$f":"IF(ISBLANK(F12),\"\",IF(AND(J12=\"m\",'[1]PODEŠAVANJA-NE BRISATI'!$D$13=8),VLOOKUP(F12,[1]sema!$AX$7:$AY$13,2),IF(AND(J12=\"z\",'[1]PODEŠAVANJA-NE BRISATI'!$D$14=8),VLOOKUP(F12,[1]sema!$AX$14:$AY$20,2),IF(AND(J12=\"m\",'[1]PODEŠAVANJA-NE BRISATI'!$D$13=16),VLOOKUP(F12,[1]sema!$AX$22:$AY$36,2),IF(AND(J12=\"z\",'[1]PODEŠAVANJA-NE BRISATI'!$D$14=16),VLOOKUP(F12,[1]sema!$AX$37:$AY$51,2),IF(AND(J12=\"m\",'[1]PODEŠAVANJA-NE BRISATI'!$D$13=32),VLOOKUP(F12,[1]sema!$AX$53:$AY$83,2),IF(AND(J12=\"z\",'[1]PODEŠAVANJA-NE BRISATI'!$D$14=32),VLOOKUP(F12,[1]sema!$AX$84:$AY$114,2),IF(AND(J12=\"m\",'[1]PODEŠAVANJA-NE BRISATI'!$D$13=64),VLOOKUP(F12,[1]sema!$AX$116:$AY$178,2),IF(AND(J12=\"z\",'[1]PODEŠAVANJA-NE BRISATI'!$D$14=64),VLOOKUP(F12,[1]sema!$AX$179:$AY$241,2),IF(AND(J12=\"mq\",'[1]PODEŠAVANJA-NE BRISATI'!$F$13=\"8>4\"),VLOOKUP(F12,[1]sema!$AX$245:$AY$248,2),IF(AND(J12=\"zq\",'[1]PODEŠAVANJA-NE BRISATI'!$F$14=\"8>4\"),VLOOKUP(F12,[1]sema!$AX$249:$AY$252,2),IF(AND(J12=\"mq\",'[1]PODEŠAVANJA-NE BRISATI'!$F$13=\"16>4\"),VLOOKUP(F12,[1]sema!$AX$254:$AY$265,2),IF(AND(J12=\"zq\",'[1]PODEŠAVANJA-NE BRISATI'!$F$14=\"16>4\"),VLOOKUP(F12,[1]sema!$AX$266:$AY$277,2),IF(AND(J12=\"mq\",'[1]PODEŠAVANJA-NE BRISATI'!$F$13=\"16>8\"),VLOOKUP(F12,[1]sema!$AX$280:$AY$287,2),IF(AND(J12=\"zq\",'[1]PODEŠAVANJA-NE BRISATI'!$F$14=\"16>8\"),VLOOKUP(F12,[1]sema!$AX$288:$AY$295,2),IF(AND(J12=\"mq\",'[1]PODEŠAVANJA-NE BRISATI'!$F$13=\"32>4\"),VLOOKUP(F12,[1]sema!$AX$298:$AY$325,2),IF(AND(J12=\"zq\",'[1]PODEŠAVANJA-NE BRISATI'!$F$14=\"32>4\"),VLOOKUP(F12,[1]sema!$AX$326:$AY$353,2),IF(AND(J12=\"mq\",'[1]PODEŠAVANJA-NE BRISATI'!$F$13=\"32>8\"),VLOOKUP(F12,[1]sema!$AX$356:$AY$379,2),IF(AND(J12=\"zq\",'[1]PODEŠAVANJA-NE BRISATI'!$F$14=\"32>8\"),VLOOKUP(F12,[1]sema!$AX$380:$AY$403,2),IF(AND(J12=\"md\",'[1]PODEŠAVANJA-NE BRISATI'!$E$13=4),VLOOKUP(F12,[1]sema!$AX$406:$AY$408,2),IF(AND(J12=\"zd\",'[1]PODEŠAVANJA-NE BRISATI'!$E$14=4),VLOOKUP(F12,[1]sema!$AX$409:$AY$411,2),IF(AND(J12=\"md\",'[1]PODEŠAVANJA-NE BRISATI'!$E$13=8),VLOOKUP(F12,[1]sema!$AX$414:$AY$420,2),IF(AND(J12=\"zd\",'[1]PODEŠAVANJA-NE BRISATI'!$E$14=8),VLOOKUP(F12,[1]sema!$AX$421:$AY$427,2),IF(AND(J12=\"md\",'[1]PODEŠAVANJA-NE BRISATI'!$E$13=16),VLOOKUP(F12,[1]sema!$AX$430:$AY$444,2),IF(AND(J12=\"zd\",'[1]PODEŠAVANJA-NE BRISATI'!$E$14=8),VLOOKUP(F12,[1]sema!$AX$445:$AY$459,2))))))))))))))))))))))))))","v":""},null,null,null,null,{"$f":"IF(ISBLANK(K12),\"\",IF(AND(O12=\"m\",'[1]PODEŠAVANJA-NE BRISATI'!$D$13=8),VLOOKUP(K12,[1]sema!$AX$7:$AY$13,2),IF(AND(O12=\"z\",'[1]PODEŠAVANJA-NE BRISATI'!$D$14=8),VLOOKUP(K12,[1]sema!$AX$14:$AY$20,2),IF(AND(O12=\"m\",'[1]PODEŠAVANJA-NE BRISATI'!$D$13=16),VLOOKUP(K12,[1]sema!$AX$22:$AY$36,2),IF(AND(O12=\"z\",'[1]PODEŠAVANJA-NE BRISATI'!$D$14=16),VLOOKUP(K12,[1]sema!$AX$37:$AY$51,2),IF(AND(O12=\"m\",'[1]PODEŠAVANJA-NE BRISATI'!$D$13=32),VLOOKUP(K12,[1]sema!$AX$53:$AY$83,2),IF(AND(O12=\"z\",'[1]PODEŠAVANJA-NE BRISATI'!$D$14=32),VLOOKUP(K12,[1]sema!$AX$84:$AY$114,2),IF(AND(O12=\"m\",'[1]PODEŠAVANJA-NE BRISATI'!$D$13=64),VLOOKUP(K12,[1]sema!$AX$116:$AY$178,2),IF(AND(O12=\"z\",'[1]PODEŠAVANJA-NE BRISATI'!$D$14=64),VLOOKUP(K12,[1]sema!$AX$179:$AY$241,2),IF(AND(O12=\"mq\",'[1]PODEŠAVANJA-NE BRISATI'!$F$13=\"8>4\"),VLOOKUP(K12,[1]sema!$AX$245:$AY$248,2),IF(AND(O12=\"zq\",'[1]PODEŠAVANJA-NE BRISATI'!$F$14=\"8>4\"),VLOOKUP(K12,[1]sema!$AX$249:$AY$252,2),IF(AND(O12=\"mq\",'[1]PODEŠAVANJA-NE BRISATI'!$F$13=\"16>4\"),VLOOKUP(K12,[1]sema!$AX$254:$AY$265,2),IF(AND(O12=\"zq\",'[1]PODEŠAVANJA-NE BRISATI'!$F$14=\"16>4\"),VLOOKUP(K12,[1]sema!$AX$266:$AY$277,2),IF(AND(O12=\"mq\",'[1]PODEŠAVANJA-NE BRISATI'!$F$13=\"16>8\"),VLOOKUP(K12,[1]sema!$AX$280:$AY$287,2),IF(AND(O12=\"zq\",'[1]PODEŠAVANJA-NE BRISATI'!$F$14=\"16>8\"),VLOOKUP(K12,[1]sema!$AX$288:$AY$295,2),IF(AND(O12=\"mq\",'[1]PODEŠAVANJA-NE BRISATI'!$F$13=\"32>4\"),VLOOKUP(K12,[1]sema!$AX$298:$AY$325,2),IF(AND(O12=\"zq\",'[1]PODEŠAVANJA-NE BRISATI'!$F$14=\"32>4\"),VLOOKUP(K12,[1]sema!$AX$326:$AY$353,2),IF(AND(O12=\"mq\",'[1]PODEŠAVANJA-NE BRISATI'!$F$13=\"32>8\"),VLOOKUP(K12,[1]sema!$AX$356:$AY$379,2),IF(AND(O12=\"zq\",'[1]PODEŠAVANJA-NE BRISATI'!$F$14=\"32>8\"),VLOOKUP(K12,[1]sema!$AX$380:$AY$403,2),IF(AND(O12=\"md\",'[1]PODEŠAVANJA-NE BRISATI'!$E$13=4),VLOOKUP(K12,[1]sema!$AX$406:$AY$408,2),IF(AND(O12=\"zd\",'[1]PODEŠAVANJA-NE BRISATI'!$E$14=4),VLOOKUP(K12,[1]sema!$AX$409:$AY$411,2),IF(AND(O12=\"md\",'[1]PODEŠAVANJA-NE BRISATI'!$E$13=8),VLOOKUP(K12,[1]sema!$AX$414:$AY$420,2),IF(AND(O12=\"zd\",'[1]PODEŠAVANJA-NE BRISATI'!$E$14=8),VLOOKUP(K12,[1]sema!$AX$421:$AY$427,2),IF(AND(O12=\"md\",'[1]PODEŠAVANJA-NE BRISATI'!$E$13=16),VLOOKUP(K12,[1]sema!$AX$430:$AY$444,2),IF(AND(O12=\"zd\",'[1]PODEŠAVANJA-NE BRISATI'!$E$14=8),VLOOKUP(K12,[1]sema!$AX$445:$AY$459,2))))))))))))))))))))))))))","v":""},null,null,null,null,null,null,1,2]
[null,null,null,null,null,null,null,null,null,null,{"$f":"IF(AND(O12=\"m\",'[1]PODEŠAVANJA-NE BRISATI'!$D$13=8),UPPER(IF(K12=\"\",\"\",VLOOKUP(K12,[1]sema!$BA$7:$BI$13,8))),IF(AND(O12=\"z\",'[1]PODEŠAVANJA-NE BRISATI'!$D$14=8),UPPER(IF(K12=\"\",\"\",VLOOKUP(K12,[1]sema!$BA$14:$BI$20,8))),IF(AND(O12=\"m\",'[1]PODEŠAVANJA-NE BRISATI'!$D$13=16),UPPER(IF(K12=\"\",\"\",VLOOKUP(K12,[1]sema!$BA$22:$BI$36,8))),IF(AND(O12=\"z\",'[1]PODEŠAVANJA-NE BRISATI'!$D$14=16),UPPER(IF(K12=\"\",\"\",VLOOKUP(K12,[1]sema!$BA$37:$BI$51,8))),IF(AND(O12=\"m\",'[1]PODEŠAVANJA-NE BRISATI'!$D$13=32),UPPER(IF(K12=\"\",\"\",VLOOKUP(K12,[1]sema!$BA$53:$BI$83,8))),IF(AND(O12=\"z\",'[1]PODEŠAVANJA-NE BRISATI'!$D$14=32),UPPER(IF(K12=\"\",\"\",VLOOKUP(K12,[1]sema!$BA$84:$BI$114,8))),IF(AND(O12=\"m\",'[1]PODEŠAVANJA-NE BRISATI'!$D$13=64),UPPER(IF(K12=\"\",\"\",VLOOKUP(K12,[1]sema!$BA$116:$BI$178,8))),IF(AND(O12=\"z\",'[1]PODEŠAVANJA-NE BRISATI'!$D$14=64),UPPER(IF(K12=\"\",\"\",VLOOKUP(K12,[1]sema!$BA$179:$BI$241,8))),IF(AND(O12=\"mq\",'[1]PODEŠAVANJA-NE BRISATI'!$F$13=\"8>4\"),UPPER(IF(K12=\"\",\"\",VLOOKUP(K12,[1]sema!$BA$245:$BI$248,8))),IF(AND(O12=\"mq\",'[1]PODEŠAVANJA-NE BRISATI'!$F$13=\"16>4\"),UPPER(IF(K12=\"\",\"\",VLOOKUP(K12,[1]sema!$BA$254:$BI$265,8))),IF(AND(O12=\"mq\",'[1]PODEŠAVANJA-NE BRISATI'!$F$13=\"16>8\"),UPPER(IF(K12=\"\",\"\",VLOOKUP(K12,[1]sema!$BA$280:$BI$287,8))),IF(AND(O12=\"mq\",'[1]PODEŠAVANJA-NE BRISATI'!$F$13=\"32>4\"),UPPER(IF(K12=\"\",\"\",VLOOKUP(K12,[1]sema!$BA$298:$BI$325,8))),IF(AND(O12=\"mq\",'[1]PODEŠAVANJA-NE BRISATI'!$F$13=\"32>8\"),UPPER(IF(K12=\"\",\"\",VLOOKUP(K12,[1]sema!$BA$356:$BI$379,8))),IF(AND(O12=\"zq\",'[1]PODEŠAVANJA-NE BRISATI'!$F$14=\"8>4\"),UPPER(IF(K12=\"\",\"\",VLOOKUP(K12,[1]sema!$BA$249:$BI$252,8))),IF(AND(O12=\"zq\",'[1]PODEŠAVANJA-NE BRISATI'!$F$14=\"16>4\"),UPPER(IF(K12=\"\",\"\",VLOOKUP(K12,[1]sema!$BA$266:$BI$277,8))),IF(AND(O12=\"zq\",'[1]PODEŠAVANJA-NE BRISATI'!$F$14=\"16>8\"),UPPER(IF(K12=\"\",\"\",VLOOKUP(K12,[1]sema!$BA$288:$BI$295,8))),IF(AND(O12=\"zq\",'[1]PODEŠAVANJA-NE BRISATI'!$F$14=\"32>4\"),UPPER(IF(K12=\"\",\"\",VLOOKUP(K12,[1]sema!$BA$326:$BI$353,8))),IF(AND(O12=\"zq\",'[1]PODEŠAVANJA-NE BRISATI'!$F$14=\"32>8\"),UPPER(IF(K12=\"\",\"\",VLOOKUP(K12,[1]sema!$BA$380:$BI$403,8))),IF(AND(O12=\"md\",'[1]PODEŠAVANJA-NE BRISATI'!$E$13=4),UPPER(IF(K12=\"\",\"\",VLOOKUP(K12,[1]sema!$BA$406:$BK$408,8))),IF(AND(O12=\"zd\",'[1]PODEŠAVANJA-NE BRISATI'!$E$14=4),UPPER(IF(K12=\"\",\"\",VLOOKUP(K12,[1]sema!$BA$409:$BK$411,8))),IF(AND(O12=\"md\",'[1]PODEŠAVANJA-NE BRISATI'!$E$13=8),UPPER(IF(K12=\"\",\"\",VLOOKUP(K12,[1]sema!$BA$414:$BK$420,8))),IF(AND(O12=\"zd\",'[1]PODEŠAVANJA-NE BRISATI'!$E$14=8),UPPER(IF(K12=\"\",\"\",VLOOKUP(K12,[1]sema!$BA$421:$BK$427,8))),IF(AND(O12=\"md\",'[1]PODEŠAVANJA-NE BRISATI'!$E$13=16),UPPER(IF(K12=\"\",\"\",VLOOKUP(K12,[1]sema!$BA$430:$BK$444,8))),IF(AND(O12=\"zd\",'[1]PODEŠAVANJA-NE BRISATI'!$E$14=16),UPPER(IF(K12=\"\",\"\",VLOOKUP(K12,[1]sema!$BA$445:$BK$459,8))),\"\"))))))))))))))))))))))))","v":""},null,null,null,null,null,1,{"$f":"AND(ISTEXT($F$12),OR($F$12=$F$20,$F$12=$F$28,$F$12=$F$36,$F$12=$F$44,$F$12=$F$52,$F$12=$F$60,$F$12=$F$68,$F$12=$K$12,$F$12=$K$20,$F$12=$K$28,$F$12=$K$36,$F$12=$K$44,$F$12=$K$52,$F$12=$K$60,$F$12=$K$68))","v":false},{"$f":"AND(ISTEXT($K$12),OR($K$12=$K$20,$K$12=$K$28,$K$12=$K$36,$K$12=$K$44,$K$12=$K$52,$K$12=$K$60,$K$12=$K$68,$K$12=$F$12,$K$12=$F$20,$K$12=$F$28,$K$12=$F$36,$K$12=$F$44,$K$12=$F$52,$K$12=$F$60,$K$12=$F$68))","v":false}]
[null,null,null,null,null,{"$f":"'Zreb CEO 10'!H5","v":"Ristic Ognjen (SLA)"},null,null,null,null,{"$f":"'Zreb CEO 10'!H6","v":"Aleksic Jovan (TOP)"},null,null,null,null,null,2,{"$f":"AND(ISTEXT($F$20),OR($F$20=$F$12,$F$20=$F$28,$F$20=$F$36,$F$20=$F$44,$F$20=$F$52,$F$20=$F$60,$F$20=$F$68,$F$20=$K$12,$F$20=$K$20,$F$20=$K$28,$F$20=$K$36,$F$20=$K$44,$F$20=$K$52,$F$20=$K$60,$F$20=$K$68))","v":false},{"$f":"AND(ISTEXT($K$20),OR($K$20=$K$12,$K$20=$K$28,$K$20=$K$36,$K$20=$K$44,$K$20=$K$52,$K$20=$K$60,$K$20=$K$68,$K$20=$F$12,$K$20=$F$20,$K$20=$F$28,$K$20=$F$36,$K$20=$F$44,$K$20=$F$52,$K$20=$F$60,$K$20=$F$68))","v":false}]
[null,null,null,null,null,null,"vs.",null,null,{"$f":"MID(F12,3,2)","v":""},null,"vs.",null,null,{"$f":"MID(K12,3,2)","v":""},null,3,{"$f":"AND(ISTEXT($F$28),OR($F$28=$F$20,$F$28=$F$12,$F$28=$F$36,$F$28=$F$44,$F$28=$F$52,$F$28=$F$60,$F$28=$F$68,$F$28=$K$12,$F$28=$K$20,$F$28=$K$28,$F$28=$K$36,$F$28=$K$44,$F$28=$K$52,$F$28=$K$60,$F$28=$K$68))","v":false},{"$f":"AND(ISTEXT($K$28),OR($K$28=$K$20,$K$28=$K$12,$K$28=$K$36,$K$28=$K$44,$K$28=$K$52,$K$28=$K$60,$K$28=$K$68,$K$28=$F$12,$K$28=$F$20,$K$28=$F$28,$K$28=$F$36,$K$28=$F$44,$K$28=$F$52,$K$28=$F$60,$K$28=$F$68))","v":false}]
[null,null,null,null,null,{"$f":"'Zreb CEO 10'!P5","v":"Stepanovic Novak (AST)"},null,null,null,null,{"$f":"'Zreb CEO 10'!P6","v":"Milic Milos (SLA)"},null,null,null,null,null,4,{"$f":"AND(ISTEXT($F$36),OR($F$36=$F$20,$F$36=$F$28,$F$36=$F$12,$F$36=$F$44,$F$36=$F$52,$F$36=$F$60,$F$36=$F$68,$F$36=$K$12,$F$36=$K$20,$F$36=$K$28,$F$36=$K$36,$F$36=$K$44,$F$36=$K$52,$F$36=$K$60,$F$36=$K$68))","v":false},{"$f":"AND(ISTEXT($K$36),OR($K$36=$K$20,$K$36=$K$28,$K$36=$K$12,$K$36=$K$44,$K$36=$K$52,$K$36=$K$60,$K$36=$K$68,$K$36=$F$12,$K$36=$F$20,$K$36=$F$28,$K$36=$F$36,$K$36=$F$44,$K$36=$F$52,$K$36=$F$60,$K$36=$F$68))","v":false}]
[null,null,null,null,null,null,null,null,null,null,{"$f":"IF(AND(O12=\"m\",'[1]PODEŠAVANJA-NE BRISATI'!$D$13=8),UPPER(IF(K12=\"\",\"\",VLOOKUP(K12,[1]sema!$BA$7:$BI$13,9))),IF(AND(O12=\"z\",'[1]PODEŠAVANJA-NE BRISATI'!$D$14=8),UPPER(IF(K12=\"\",\"\",VLOOKUP(K12,[1]sema!$BA$14:$BI$20,9))),IF(AND(O12=\"m\",'[1]PODEŠAVANJA-NE BRISATI'!$D$13=16),UPPER(IF(K12=\"\",\"\",VLOOKUP(K12,[1]sema!$BA$22:$BI$36,9))),IF(AND(O12=\"z\",'[1]PODEŠAVANJA-NE BRISATI'!$D$14=16),UPPER(IF(K12=\"\",\"\",VLOOKUP(K12,[1]sema!$BA$37:$BI$51,9))),IF(AND(O12=\"m\",'[1]PODEŠAVANJA-NE BRISATI'!$D$13=32),UPPER(IF(K12=\"\",\"\",VLOOKUP(K12,[1]sema!$BA$53:$BI$83,9))),IF(AND(O12=\"z\",'[1]PODEŠAVANJA-NE BRISATI'!$D$14=32),UPPER(IF(K12=\"\",\"\",VLOOKUP(K12,[1]sema!$BA$84:$BI$114,9))),IF(AND(O12=\"m\",'[1]PODEŠAVANJA-NE BRISATI'!$D$13=64),UPPER(IF(K12=\"\",\"\",VLOOKUP(K12,[1]sema!$BA$116:$BI$178,9))),IF(AND(O12=\"z\",'[1]PODEŠAVANJA-NE BRISATI'!$D$14=64),UPPER(IF(K12=\"\",\"\",VLOOKUP(K12,[1]sema!$BA$179:$BI$241,9))),IF(AND(O12=\"mq\",'[1]PODEŠAVANJA-NE BRISATI'!$F$13=\"8>4\"),UPPER(IF(K12=\"\",\"\",VLOOKUP(K12,[1]sema!$BA$245:$BI$248,9))),IF(AND(O12=\"mq\",'[1]PODEŠAVANJA-NE BRISATI'!$F$13=\"16>4\"),UPPER(IF(K12=\"\",\"\",VLOOKUP(K12,[1]sema!$BA$254:$BI$265,9))),IF(AND(O12=\"mq\",'[1]PODEŠAVANJA-NE BRISATI'!$F$13=\"16>8\"),UPPER(IF(K12=\"\",\"\",VLOOKUP(K12,[1]sema!$BA$280:$BI$287,9))),IF(AND(O12=\"mq\",'[1]PODEŠAVANJA-NE BRISATI'!$F$13=\"32>4\"),UPPER(IF(K12=\"\",\"\",VLOOKUP(K12,[1]sema!$BA$298:$BI$325,9))),IF(AND(O12=\"mq\",'[1]PODEŠAVANJA-NE BRISATI'!$F$13=\"32>8\"),UPPER(IF(K12=\"\",\"\",VLOOKUP(K12,[1]sema!$BA$356:$BI$379,9))),IF(AND(O12=\"zq\",'[1]PODEŠAVANJA-NE BRISATI'!$F$14=\"8>4\"),UPPER(IF(K12=\"\",\"\",VLOOKUP(K12,[1]sema!$BA$249:$BI$252,9))),IF(AND(O12=\"zq\",'[1]PODEŠAVANJA-NE BRISATI'!$F$14=\"16>4\"),UPPER(IF(K12=\"\",\"\",VLOOKUP(K12,[1]sema!$BA$266:$BI$277,9))),IF(AND(O12=\"zq\",'[1]PODEŠAVANJA-NE BRISATI'!$F$14=\"16>8\"),UPPER(IF(K12=\"\",\"\",VLOOKUP(K12,[1]sema!$BA$288:$BI$295,9))),IF(AND(O12=\"zq\",'[1]PODEŠAVANJA-NE BRISATI'!$F$14=\"32>4\"),UPPER(IF(K12=\"\",\"\",VLOOKUP(K12,[1]sema!$BA$326:$BI$353,9))),IF(AND(O12=\"zq\",'[1]PODEŠAVANJA-NE BRISATI'!$F$14=\"32>8\"),UPPER(IF(K12=\"\",\"\",VLOOKUP(K12,[1]sema!$BA$380:$BI$403,9))),IF(AND(O12=\"md\",'[1]PODEŠAVANJA-NE BRISATI'!$E$13=4),UPPER(IF(K12=\"\",\"\",VLOOKUP(K12,[1]sema!$BA$406:$BK$408,11))),IF(AND(O12=\"zd\",'[1]PODEŠAVANJA-NE BRISATI'!$E$14=4),UPPER(IF(K12=\"\",\"\",VLOOKUP(K12,[1]sema!$BA$409:$BK$411,11))),IF(AND(O12=\"md\",'[1]PODEŠAVANJA-NE BRISATI'!$E$13=8),UPPER(IF(K12=\"\",\"\",VLOOKUP(K12,[1]sema!$BA$414:$BK$420,11))),IF(AND(O12=\"zd\",'[1]PODEŠAVANJA-NE BRISATI'!$E$14=8),UPPER(IF(K12=\"\",\"\",VLOOKUP(K12,[1]sema!$BA$421:$BK$427,11))),IF(AND(O12=\"md\",'[1]PODEŠAVANJA-NE BRISATI'!$E$13=16),UPPER(IF(K12=\"\",\"\",VLOOKUP(K12,[1]sema!$BA$430:$BK$444,11))),IF(AND(O12=\"zd\",'[1]PODEŠAVANJA-NE BRISATI'!$E$14=16),UPPER(IF(K12=\"\",\"\",VLOOKUP(K12,[1]sema!$BA$445:$BK$459,11))),\"\"))))))))))))))))))))))))","v":""},null,null,null,null,null,5,{"$f":"AND(ISTEXT($F$44),OR($F$44=$F$20,$F$44=$F$28,$F$44=$F$36,$F$44=$F$12,$F$44=$F$52,$F$44=$F$60,$F$44=$F$68,$F$44=$K$12,$F$44=$K$20,$F$44=$K$28,$F$44=$K$36,$F$44=$K$44,$F$44=$K$52,$F$44=$K$60,$F$44=$K$68))","v":false},{"$f":"AND(ISTEXT($K$44),OR($K$44=$K$20,$K$44=$K$28,$K$44=$K$36,$K$44=$K$12,$K$44=$K$52,$K$44=$K$60,$K$44=$K$68,$K$44=$F$12,$K$44=$F$20,$K$44=$F$28,$K$44=$F$36,$K$44=$F$44,$K$44=$F$52,$K$44=$F$60,$K$44=$F$68))","v":false}]
[null,null,null,null,null,"MEC 1",null,null,null,null,"MEC 2",null,null,null,null,null,6,{"$f":"AND(ISTEXT($F$52),OR($F$52=$F$20,$F$52=$F$28,$F$52=$F$36,$F$52=$F$44,$F$52=$F$12,$F$52=$F$60,$F$52=$F$68,$F$52=$K$12,$F$52=$K$20,$F$52=$K$28,$F$52=$K$36,$F$52=$K$44,$F$52=$K$52,$F$52=$K$60,$F$52=$K$68))","v":false},{"$f":"AND(ISTEXT($K$52),OR($K$52=$K$20,$K$52=$K$28,$K$52=$K$36,$K$52=$K$44,$K$52=$K$12,$K$52=$K$60,$K$52=$K$68,$K$52=$F$12,$K$52=$F$20,$K$52=$F$28,$K$52=$F$36,$K$52=$F$44,$K$52=$F$52,$K$52=$F$60,$K$52=$F$68))","v":false}]
[null,null,null,null,null,"NE PRE 11:30",null,null,null,null,"NE PRE 11:30",null,null,null,null,null,7,{"$f":"AND(ISTEXT($F$60),OR($F$60=$F$20,$F$60=$F$28,$F$60=$F$36,$F$60=$F$44,$F$60=$F$52,$F$60=$F$12,$F$60=$F$68,$F$60=$K$12,$F$60=$K$20,$F$60=$K$28,$F$60=$K$36,$F$60=$K$44,$F$60=$K$52,$F$60=$K$60,$F$60=$K$68))","v":false},{"$f":"AND(ISTEXT($K$60),OR($K$60=$K$20,$K$60=$K$28,$K$60=$K$36,$K$60=$K$44,$K$60=$K$52,$K$60=$K$12,$K$60=$K$68,$K$60=$F$12,$K$60=$F$20,$K$60=$F$28,$K$60=$F$36,$K$60=$F$44,$K$60=$F$52,$K$60=$F$60,$K$60=$F$68))","v":false}]
[null,null,null,null,"2. MEC",{"$f":"IF(ISBLANK(F20),\"\",IF(AND(J20=\"m\",'[1]PODEŠAVANJA-NE BRISATI'!$D$13=8),VLOOKUP(F20,[1]sema!$AX$7:$AY$13,2),IF(AND(J20=\"z\",'[1]PODEŠAVANJA-NE BRISATI'!$D$14=8),VLOOKUP(F20,[1]sema!$AX$14:$AY$20,2),IF(AND(J20=\"m\",'[1]PODEŠAVANJA-NE BRISATI'!$D$13=16),VLOOKUP(F20,[1]sema!$AX$22:$AY$36,2),IF(AND(J20=\"z\",'[1]PODEŠAVANJA-NE BRISATI'!$D$14=16),VLOOKUP(F20,[1]sema!$AX$37:$AY$51,2),IF(AND(J20=\"m\",'[1]PODEŠAVANJA-NE BRISATI'!$D$13=32),VLOOKUP(F20,[1]sema!$AX$53:$AY$83,2),IF(AND(J20=\"z\",'[1]PODEŠAVANJA-NE BRISATI'!$D$14=32),VLOOKUP(F20,[1]sema!$AX$84:$AY$114,2),IF(AND(J20=\"m\",'[1]PODEŠAVANJA-NE BRISATI'!$D$13=64),VLOOKUP(F20,[1]sema!$AX$116:$AY$178,2),IF(AND(J20=\"z\",'[1]PODEŠAVANJA-NE BRISATI'!$D$14=64),VLOOKUP(F20,[1]sema!$AX$179:$AY$241,2),IF(AND(J20=\"mq\",'[1]PODEŠAVANJA-NE BRISATI'!$F$13=\"8>4\"),VLOOKUP(F20,[1]sema!$AX$245:$AY$248,2),IF(AND(J20=\"zq\",'[1]PODEŠAVANJA-NE BRISATI'!$F$14=\"8>4\"),VLOOKUP(F20,[1]sema!$AX$249:$AY$252,2),IF(AND(J20=\"mq\",'[1]PODEŠAVANJA-NE BRISATI'!$F$13=\"16>4\"),VLOOKUP(F20,[1]sema!$AX$254:$AY$265,2),IF(AND(J20=\"zq\",'[1]PODEŠAVANJA-NE BRISATI'!$F$14=\"16>4\"),VLOOKUP(F20,[1]sema!$AX$266:$AY$277,2),IF(AND(J20=\"mq\",'[1]PODEŠAVANJA-NE BRISATI'!$F$13=\"16>8\"),VLOOKUP(F20,[1]sema!$AX$280:$AY$287,2),IF(AND(J20=\"zq\",'[1]PODEŠAVANJA-NE BRISATI'!$F$14=\"16>8\"),VLOOKUP(F20,[1]sema!$AX$288:$AY$295,2),IF(AND(J20=\"mq\",'[1]PODEŠAVANJA-NE BRISATI'!$F$13=\"32>4\"),VLOOKUP(F20,[1]sema!$AX$298:$AY$325,2),IF(AND(J20=\"zq\",'[1]PODEŠAVANJA-NE BRISATI'!$F$14=\"32>4\"),VLOOKUP(F20,[1]sema!$AX$326:$AY$353,2),IF(AND(J20=\"mq\",'[1]PODEŠAVANJA-NE BRISATI'!$F$13=\"32>8\"),VLOOKUP(F20,[1]sema!$AX$356:$AY$379,2),IF(AND(J20=\"zq\",'[1]PODEŠAVANJA-NE BRISATI'!$F$14=\"32>8\"),VLOOKUP(F20,[1]sema!$AX$380:$AY$403,2),IF(AND(J20=\"md\",'[1]PODEŠAVANJA-NE BRISATI'!$E$13=4),VLOOKUP(F20,[1]sema!$AX$406:$AY$408,2),IF(AND(J20=\"zd\",'[1]PODEŠAVANJA-NE BRISATI'!$E$14=4),VLOOKUP(F20,[1]sema!$AX$409:$AY$411,2),IF(AND(J20=\"md\",'[1]PODEŠAVANJA-NE BRISATI'!$E$13=8),VLOOKUP(F20,[1]sema!$AX$414:$AY$420,2),IF(AND(J20=\"zd\",'[1]PODEŠAVANJA-NE BRISATI'!$E$14=8),VLOOKUP(F20,[1]sema!$AX$421:$AY$427,2),IF(AND(J20=\"md\",'[1]PODEŠAVANJA-NE BRISATI'!$E$13=16),VLOOKUP(F20,[1]sema!$AX$430:$AY$444,2),IF(AND(J20=\"zd\",'[1]PODEŠAVANJA-NE BRISATI'!$E$14=8),VLOOKUP(F20,[1]sema!$AX$445:$AY$459,2))))))))))))))))))))))))))","v":""},null,null,null,null,{"$f":"IF(ISBLANK(K20),\"\",IF(AND(O20=\"m\",'[1]PODEŠAVANJA-NE BRISATI'!$D$13=8),VLOOKUP(K20,[1]sema!$AX$7:$AY$13,2),IF(AND(O20=\"z\",'[1]PODEŠAVANJA-NE BRISATI'!$D$14=8),VLOOKUP(K20,[1]sema!$AX$14:$AY$20,2),IF(AND(O20=\"m\",'[1]PODEŠAVANJA-NE BRISATI'!$D$13=16),VLOOKUP(K20,[1]sema!$AX$22:$AY$36,2),IF(AND(O20=\"z\",'[1]PODEŠAVANJA-NE BRISATI'!$D$14=16),VLOOKUP(K20,[1]sema!$AX$37:$AY$51,2),IF(AND(O20=\"m\",'[1]PODEŠAVANJA-NE BRISATI'!$D$13=32),VLOOKUP(K20,[1]sema!$AX$53:$AY$83,2),IF(AND(O20=\"z\",'[1]PODEŠAVANJA-NE BRISATI'!$D$14=32),VLOOKUP(K20,[1]sema!$AX$84:$AY$114,2),IF(AND(O20=\"m\",'[1]PODEŠAVANJA-NE BRISATI'!$D$13=64),VLOOKUP(K20,[1]sema!$AX$116:$AY$178,2),IF(AND(O20=\"z\",'[1]PODEŠAVANJA-NE BRISATI'!$D$14=64),VLOOKUP(K20,[1]sema!$AX$179:$AY$241,2),IF(AND(O20=\"mq\",'[1]PODEŠAVANJA-NE BRISATI'!$F$13=\"8>4\"),VLOOKUP(K20,[1]sema!$AX$245:$AY$248,2),IF(AND(O20=\"zq\",'[1]PODEŠAVANJA-NE BRISATI'!$F$14=\"8>4\"),VLOOKUP(K20,[1]sema!$AX$249:$AY$252,2),IF(AND(O20=\"mq\",'[1]PODEŠAVANJA-NE BRISATI'!$F$13=\"16>4\"),VLOOKUP(K20,[1]sema!$AX$254:$AY$265,2),IF(AND(O20=\"zq\",'[1]PODEŠAVANJA-NE BRISATI'!$F$14=\"16>4\"),VLOOKUP(K20,[1]sema!$AX$266:$AY$277,2),IF(AND(O20=\"mq\",'[1]PODEŠAVANJA-NE BRISATI'!$F$13=\"16>8\"),VLOOKUP(K20,[1]sema!$AX$280:$AY$287,2),IF(AND(O20=\"zq\",'[1]PODEŠAVANJA-NE BRISATI'!$F$14=\"16>8\"),VLOOKUP(K20,[1]sema!$AX$288:$AY$295,2),IF(AND(O20=\"mq\",'[1]PODEŠAVANJA-NE BRISATI'!$F$13=\"32>4\"),VLOOKUP(K20,[1]sema!$AX$298:$AY$325,2),IF(AND(O20=\"zq\",'[1]PODEŠAVANJA-NE BRISATI'!$F$14=\"32>4\"),VLOOKUP(K20,[1]sema!$AX$326:$AY$353,2),IF(AND(O20=\"mq\",'[1]PODEŠAVANJA-NE BRISATI'!$F$13=\"32>8\"),VLOOKUP(K20,[1]sema!$AX$356:$AY$379,2),IF(AND(O20=\"zq\",'[1]PODEŠAVANJA-NE BRISATI'!$F$14=\"32>8\"),VLOOKUP(K20,[1]sema!$AX$380:$AY$403,2),IF(AND(O20=\"md\",'[1]PODEŠAVANJA-NE BRISATI'!$E$13=4),VLOOKUP(K20,[1]sema!$AX$406:$AY$408,2),IF(AND(O20=\"zd\",'[1]PODEŠAVANJA-NE BRISATI'!$E$14=4),VLOOKUP(K20,[1]sema!$AX$409:$AY$411,2),IF(AND(O20=\"md\",'[1]PODEŠAVANJA-NE BRISATI'!$E$13=8),VLOOKUP(K20,[1]sema!$AX$414:$AY$420,2),IF(AND(O20=\"zd\",'[1]PODEŠAVANJA-NE BRISATI'!$E$14=8),VLOOKUP(K20,[1]sema!$AX$421:$AY$427,2),IF(AND(O20=\"md\",'[1]PODEŠAVANJA-NE BRISATI'!$E$13=16),VLOOKUP(K20,[1]sema!$AX$430:$AY$444,2),IF(AND(O20=\"zd\",'[1]PODEŠAVANJA-NE BRISATI'!$E$14=8),VLOOKUP(K20,[1]sema!$AX$445:$AY$459,2))))))))))))))))))))))))))","v":""},null,null,null,null,null,8,{"$f":"AND(ISTEXT($F$68),OR($F$68=$F$20,$F$68=$F$28,$F$68=$F$36,$F$68=$F$44,$F$68=$F$52,$F$68=$F$60,$F$68=$F$12,$F$68=$K$12,$F$68=$K$20,$F$68=$K$28,$F$68=$K$36,$F$68=$K$44,$F$68=$K$52,$F$68=$K$60,$F$68=$K$68))","v":false},{"$f":"AND(ISTEXT($K$68),OR($K$68=$K$20,$K$68=$K$28,$K$68=$K$36,$K$68=$K$44,$K$68=$K$52,$K$68=$K$60,$K$68=$K$12,$K$68=$F$12,$K$68=$F$20,$K$68=$F$28,$K$68=$F$36,$K$68=$F$44,$K$68=$F$52,$K$68=$F$60,$K$68=$F$68))","v":false}]
[null,null,null,null,null,{"$f":"IF(AND(J20=\"m\",'[1]PODEŠAVANJA-NE BRISATI'!$D$13=8),UPPER(IF(F20=\"\",\"\",VLOOKUP(F20,[1]sema!$BA$7:$BI$13,8))),IF(AND(J20=\"z\",'[1]PODEŠAVANJA-NE BRISATI'!$D$14=8),UPPER(IF(F20=\"\",\"\",VLOOKUP(F20,[1]sema!$BA$14:$BI$20,8))),IF(AND(J20=\"m\",'[1]PODEŠAVANJA-NE BRISATI'!$D$13=16),UPPER(IF(F20=\"\",\"\",VLOOKUP(F20,[1]sema!$BA$22:$BI$36,8))),IF(AND(J20=\"z\",'[1]PODEŠAVANJA-NE BRISATI'!$D$14=16),UPPER(IF(F20=\"\",\"\",VLOOKUP(F20,[1]sema!$BA$37:$BI$51,8))),IF(AND(J20=\"m\",'[1]PODEŠAVANJA-NE BRISATI'!$D$13=32),UPPER(IF(F20=\"\",\"\",VLOOKUP(F20,[1]sema!$BA$53:$BI$83,8))),IF(AND(J20=\"z\",'[1]PODEŠAVANJA-NE BRISATI'!$D$14=32),UPPER(IF(F20=\"\",\"\",VLOOKUP(F20,[1]sema!$BA$84:$BI$114,8))),IF(AND(J20=\"m\",'[1]PODEŠAVANJA-NE BRISATI'!$D$13=64),UPPER(IF(F20=\"\",\"\",VLOOKUP(F20,[1]sema!$BA$116:$BI$178,8))),IF(AND(J20=\"z\",'[1]PODEŠAVANJA-NE BRISATI'!$D$14=64),UPPER(IF(F20=\"\",\"\",VLOOKUP(F20,[1]sema!$BA$179:$BI$241,8))),IF(AND(J20=\"mq\",'[1]PODEŠAVANJA-NE BRISATI'!$F$13=\"8>4\"),UPPER(IF(F20=\"\",\"\",VLOOKUP(F20,[1]sema!$BA$245:$BI$248,8))),IF(AND(J20=\"mq\",'[1]PODEŠAVANJA-NE BRISATI'!$F$13=\"16>4\"),UPPER(IF(F20=\"\",\"\",VLOOKUP(F20,[1]sema!$BA$254:$BI$265,8))),IF(AND(J20=\"mq\",'[1]PODEŠAVANJA-NE BRISATI'!$F$13=\"16>8\"),UPPER(IF(F20=\"\",\"\",VLOOKUP(F20,[1]sema!$BA$280:$BI$287,8))),IF(AND(J20=\"mq\",'[1]PODEŠAVANJA-NE BRISATI'!$F$13=\"32>4\"),UPPER(IF(F20=\"\",\"\",VLOOKUP(F20,[1]sema!$BA$298:$BI$325,8))),IF(AND(J20=\"mq\",'[1]PODEŠAVANJA-NE BRISATI'!$F$13=\"32>8\"),UPPER(IF(F20=\"\",\"\",VLOOKUP(F20,[1]sema!$BA$356:$BI$379,8))),IF(AND(J20=\"zq\",'[1]PODEŠAVANJA-NE BRISATI'!$F$14=\"8>4\"),UPPER(IF(F20=\"\",\"\",VLOOKUP(F20,[1]sema!$BA$249:$BI$252,8))),IF(AND(J20=\"zq\",'[1]PODEŠAVANJA-NE BRISATI'!$F$14=\"16>4\"),UPPER(IF(F20=\"\",\"\",VLOOKUP(F20,[1]sema!$BA$266:$BI$277,8))),IF(AND(J20=\"zq\",'[1]PODEŠAVANJA-NE BRISATI'!$F$14=\"16>8\"),UPPER(IF(F20=\"\",\"\",VLOOKUP(F20,[1]sema!$BA$288:$BI$295,8))),IF(AND(J20=\"zq\",'[1]PODEŠAVANJA-NE BRISATI'!$F$14=\"32>4\"),UPPER(IF(F20=\"\",\"\",VLOOKUP(F20,[1]sema!$BA$326:$BI$353,8))),IF(AND(J20=\"zq\",'[1]PODEŠAVANJA-NE BRISATI'!$F$14=\"32>8\"),UPPER(IF(F20=\"\",\"\",VLOOKUP(F20,[1]sema!$BA$380:$BI$403,8))),IF(AND(J20=\"md\",'[1]PODEŠAVANJA-NE BRISATI'!$E$13=4),UPPER(IF(F20=\"\",\"\",VLOOKUP(F20,[1]sema!$BA$406:$BK$408,8))),IF(AND(J20=\"zd\",'[1]PODEŠAVANJA-NE BRISATI'!$E$14=4),UPPER(IF(F20=\"\",\"\",VLOOKUP(F20,[1]sema!$BA$409:$BK$411,8))),IF(AND(J20=\"md\",'[1]PODEŠAVANJA-NE BRISATI'!$E$13=8),UPPER(IF(F20=\"\",\"\",VLOOKUP(F20,[1]sema!$BA$414:$BK$420,8))),IF(AND(J20=\"zd\",'[1]PODEŠAVANJA-NE BRISATI'!$E$14=8),UPPER(IF(F20=\"\",\"\",VLOOKUP(F20,[1]sema!$BA$421:$BK$427,8))),IF(AND(J20=\"md\",'[1]PODEŠAVANJA-NE BRISATI'!$E$13=16),UPPER(IF(F20=\"\",\"\",VLOOKUP(F20,[1]sema!$BA$430:$BK$444,8))),IF(AND(J20=\"zd\",'[1]PODEŠAVANJA-NE BRISATI'!$E$14=16),UPPER(IF(F20=\"\",\"\",VLOOKUP(F20,[1]sema!$BA$445:$BK$459,8))),\"\"))))))))))))))))))))))))","v":""},null,null,null,null,{"$f":"IF(AND(O20=\"m\",'[1]PODEŠAVANJA-NE BRISATI'!$D$13=8),UPPER(IF(K20=\"\",\"\",VLOOKUP(K20,[1]sema!$BA$7:$BI$13,8))),IF(AND(O20=\"z\",'[1]PODEŠAVANJA-NE BRISATI'!$D$14=8),UPPER(IF(K20=\"\",\"\",VLOOKUP(K20,[1]sema!$BA$14:$BI$20,8))),IF(AND(O20=\"m\",'[1]PODEŠAVANJA-NE BRISATI'!$D$13=16),UPPER(IF(K20=\"\",\"\",VLOOKUP(K20,[1]sema!$BA$22:$BI$36,8))),IF(AND(O20=\"z\",'[1]PODEŠAVANJA-NE BRISATI'!$D$14=16),UPPER(IF(K20=\"\",\"\",VLOOKUP(K20,[1]sema!$BA$37:$BI$51,8))),IF(AND(O20=\"m\",'[1]PODEŠAVANJA-NE BRISATI'!$D$13=32),UPPER(IF(K20=\"\",\"\",VLOOKUP(K20,[1]sema!$BA$53:$BI$83,8))),IF(AND(O20=\"z\",'[1]PODEŠAVANJA-NE BRISATI'!$D$14=32),UPPER(IF(K20=\"\",\"\",VLOOKUP(K20,[1]sema!$BA$84:$BI$114,8))),IF(AND(O20=\"m\",'[1]PODEŠAVANJA-NE BRISATI'!$D$13=64),UPPER(IF(K20=\"\",\"\",VLOOKUP(K20,[1]sema!$BA$116:$BI$178,8))),IF(AND(O20=\"z\",'[1]PODEŠAVANJA-NE BRISATI'!$D$14=64),UPPER(IF(K20=\"\",\"\",VLOOKUP(K20,[1]sema!$BA$179:$BI$241,8))),IF(AND(O20=\"mq\",'[1]PODEŠAVANJA-NE BRISATI'!$F$13=\"8>4\"),UPPER(IF(K20=\"\",\"\",VLOOKUP(K20,[1]sema!$BA$245:$BI$248,8))),IF(AND(O20=\"mq\",'[1]PODEŠAVANJA-NE BRISATI'!$F$13=\"16>4\"),UPPER(IF(K20=\"\",\"\",VLOOKUP(K20,[1]sema!$BA$254:$BI$265,8))),IF(AND(O20=\"mq\",'[1]PODEŠAVANJA-NE BRISATI'!$F$13=\"16>8\"),UPPER(IF(K20=\"\",\"\",VLOOKUP(K20,[1]sema!$BA$280:$BI$287,8))),IF(AND(O20=\"mq\",'[1]PODEŠAVANJA-NE BRISATI'!$F$13=\"32>4\"),UPPER(IF(K20=\"\",\"\",VLOOKUP(K20,[1]sema!$BA$298:$BI$325,8))),IF(AND(O20=\"mq\",'[1]PODEŠAVANJA-NE BRISATI'!$F$13=\"32>8\"),UPPER(IF(K20=\"\",\"\",VLOOKUP(K20,[1]sema!$BA$356:$BI$379,8))),IF(AND(O20=\"zq\",'[1]PODEŠAVANJA-NE BRISATI'!$F$14=\"8>4\"),UPPER(IF(K20=\"\",\"\",VLOOKUP(K20,[1]sema!$BA$249:$BI$252,8))),IF(AND(O20=\"zq\",'[1]PODEŠAVANJA-NE BRISATI'!$F$14=\"16>4\"),UPPER(IF(K20=\"\",\"\",VLOOKUP(K20,[1]sema!$BA$266:$BI$277,8))),IF(AND(O20=\"zq\",'[1]PODEŠAVANJA-NE BRISATI'!$F$14=\"16>8\"),UPPER(IF(K20=\"\",\"\",VLOOKUP(K20,[1]sema!$BA$288:$BI$295,8))),IF(AND(O20=\"zq\",'[1]PODEŠAVANJA-NE BRISATI'!$F$14=\"32>4\"),UPPER(IF(K20=\"\",\"\",VLOOKUP(K20,[1]sema!$BA$326:$BI$353,8))),IF(AND(O20=\"zq\",'[1]PODEŠAVANJA-NE BRISATI'!$F$14=\"32>8\"),UPPER(IF(K20=\"\",\"\",VLOOKUP(K20,[1]sema!$BA$380:$BI$403,8))),IF(AND(O20=\"md\",'[1]PODEŠAVANJA-NE BRISATI'!$E$13=4),UPPER(IF(K20=\"\",\"\",VLOOKUP(K20,[1]sema!$BA$406:$BK$408,8))),IF(AND(O20=\"zd\",'[1]PODEŠAVANJA-NE BRISATI'!$E$14=4),UPPER(IF(K20=\"\",\"\",VLOOKUP(K20,[1]sema!$BA$409:$BK$411,8))),IF(AND(O20=\"md\",'[1]PODEŠAVANJA-NE BRISATI'!$E$13=8),UPPER(IF(K20=\"\",\"\",VLOOKUP(K20,[1]sema!$BA$414:$BK$420,8))),IF(AND(O20=\"zd\",'[1]PODEŠAVANJA-NE BRISATI'!$E$14=8),UPPER(IF(K20=\"\",\"\",VLOOKUP(K20,[1]sema!$BA$421:$BK$427,8))),IF(AND(O20=\"md\",'[1]PODEŠAVANJA-NE BRISATI'!$E$13=16),UPPER(IF(K20=\"\",\"\",VLOOKUP(K20,[1]sema!$BA$430:$BK$444,8))),IF(AND(O20=\"zd\",'[1]PODEŠAVANJA-NE BRISATI'!$E$14=16),UPPER(IF(K20=\"\",\"\",VLOOKUP(K20,[1]sema!$BA$445:$BK$459,8))),\"\"))))))))))))))))))))))))","v":""}]
[null,null,null,null,null,{"$f":"'Zreb CEO 10'!H7","v":"Mladenovic Janko (AST)"},null,null,null,null,{"$f":"'Zreb CEO 10'!H8","v":"Jovanovic Filip (TAZ)"}]
[null,null,null,null,null,null,"vs.",null,null,{"$f":"MID(F20,3,2)","v":""},null,"vs.",null,null,{"$f":"MID(K20,3,2)","v":""}]
[null,null,null,null,null,{"$f":"'Zreb CEO 10'!P7","v":"Stanimirovic Vukan (SLA)"},null,null,null,null,{"$f":"'Zreb CEO 10'!P8","v":"Vujcic Veljko (SLA)"}]
[null,null,null,null,null,{"$f":"IF(AND(J20=\"m\",'[1]PODEŠAVANJA-NE BRISATI'!$D$13=8),UPPER(IF(F20=\"\",\"\",VLOOKUP(F20,[1]sema!$BA$7:$BI$13,9))),IF(AND(J20=\"z\",'[1]PODEŠAVANJA-NE BRISATI'!$D$14=8),UPPER(IF(F20=\"\",\"\",VLOOKUP(F20,[1]sema!$BA$14:$BI$20,9))),IF(AND(J20=\"m\",'[1]PODEŠAVANJA-NE BRISATI'!$D$13=16),UPPER(IF(F20=\"\",\"\",VLOOKUP(F20,[1]sema!$BA$22:$BI$36,9))),IF(AND(J20=\"z\",'[1]PODEŠAVANJA-NE BRISATI'!$D$14=16),UPPER(IF(F20=\"\",\"\",VLOOKUP(F20,[1]sema!$BA$37:$BI$51,9))),IF(AND(J20=\"m\",'[1]PODEŠAVANJA-NE BRISATI'!$D$13=32),UPPER(IF(F20=\"\",\"\",VLOOKUP(F20,[1]sema!$BA$53:$BI$83,9))),IF(AND(J20=\"z\",'[1]PODEŠAVANJA-NE BRISATI'!$D$14=32),UPPER(IF(F20=\"\",\"\",VLOOKUP(F20,[1]sema!$BA$84:$BI$114,9))),IF(AND(J20=\"m\",'[1]PODEŠAVANJA-NE BRISATI'!$D$13=64),UPPER(IF(F20=\"\",\"\",VLOOKUP(F20,[1]sema!$BA$116:$BI$178,9))),IF(AND(J20=\"z\",'[1]PODEŠAVANJA-NE BRISATI'!$D$14=64),UPPER(IF(F20=\"\",\"\",VLOOKUP(F20,[1]sema!$BA$179:$BI$241,9))),IF(AND(J20=\"mq\",'[1]PODEŠAVANJA-NE BRISATI'!$F$13=\"8>4\"),UPPER(IF(F20=\"\",\"\",VLOOKUP(F20,[1]sema!$BA$245:$BI$248,9))),IF(AND(J20=\"mq\",'[1]PODEŠAVANJA-NE BRISATI'!$F$13=\"16>4\"),UPPER(IF(F20=\"\",\"\",VLOOKUP(F20,[1]sema!$BA$254:$BI$265,9))),IF(AND(J20=\"mq\",'[1]PODEŠAVANJA-NE BRISATI'!$F$13=\"16>8\"),UPPER(IF(F20=\"\",\"\",VLOOKUP(F20,[1]sema!$BA$280:$BI$287,9))),IF(AND(J20=\"mq\",'[1]PODEŠAVANJA-NE BRISATI'!$F$13=\"32>4\"),UPPER(IF(F20=\"\",\"\",VLOOKUP(F20,[1]sema!$BA$298:$BI$325,9))),IF(AND(J20=\"mq\",'[1]PODEŠAVANJA-NE BRISATI'!$F$13=\"32>8\"),UPPER(IF(F20=\"\",\"\",VLOOKUP(F20,[1]sema!$BA$356:$BI$379,9))),IF(AND(J20=\"zq\",'[1]PODEŠAVANJA-NE BRISATI'!$F$14=\"8>4\"),UPPER(IF(F20=\"\",\"\",VLOOKUP(F20,[1]sema!$BA$249:$BI$252,9))),IF(AND(J20=\"zq\",'[1]PODEŠAVANJA-NE BRISATI'!$F$14=\"16>4\"),UPPER(IF(F20=\"\",\"\",VLOOKUP(F20,[1]sema!$BA$266:$BI$277,9))),IF(AND(J20=\"zq\",'[1]PODEŠAVANJA-NE BRISATI'!$F$14=\"16>8\"),UPPER(IF(F20=\"\",\"\",VLOOKUP(F20,[1]sema!$BA$288:$BI$295,9))),IF(AND(J20=\"zq\",'[1]PODEŠAVANJA-NE BRISATI'!$F$14=\"32>4\"),UPPER(IF(F20=\"\",\"\",VLOOKUP(F20,[1]sema!$BA$326:$BI$353,9))),IF(AND(J20=\"zq\",'[1]PODEŠAVANJA-NE BRISATI'!$F$14=\"32>8\"),UPPER(IF(F20=\"\",\"\",VLOOKUP(F20,[1]sema!$BA$380:$BI$403,9))),IF(AND(J20=\"md\",'[1]PODEŠAVANJA-NE BRISATI'!$E$13=4),UPPER(IF(F20=\"\",\"\",VLOOKUP(F20,[1]sema!$BA$406:$BK$408,11))),IF(AND(J20=\"zd\",'[1]PODEŠAVANJA-NE BRISATI'!$E$14=4),UPPER(IF(F20=\"\",\"\",VLOOKUP(F20,[1]sema!$BA$409:$BK$411,11))),IF(AND(J20=\"md\",'[1]PODEŠAVANJA-NE BRISATI'!$E$13=8),UPPER(IF(F20=\"\",\"\",VLOOKUP(F20,[1]sema!$BA$414:$BK$420,11))),IF(AND(J20=\"zd\",'[1]PODEŠAVANJA-NE BRISATI'!$E$14=8),UPPER(IF(F20=\"\",\"\",VLOOKUP(F20,[1]sema!$BA$421:$BK$427,11))),IF(AND(J20=\"md\",'[1]PODEŠAVANJA-NE BRISATI'!$E$13=16),UPPER(IF(F20=\"\",\"\",VLOOKUP(F20,[1]sema!$BA$430:$BK$444,11))),IF(AND(J20=\"zd\",'[1]PODEŠAVANJA-NE BRISATI'!$E$14=16),UPPER(IF(F20=\"\",\"\",VLOOKUP(F20,[1]sema!$BA$445:$BK$459,11))),\"\"))))))))))))))))))))))))","v":""},null,null,null,null,{"$f":"IF(AND(O20=\"m\",'[1]PODEŠAVANJA-NE BRISATI'!$D$13=8),UPPER(IF(K20=\"\",\"\",VLOOKUP(K20,[1]sema!$BA$7:$BI$13,9))),IF(AND(O20=\"z\",'[1]PODEŠAVANJA-NE BRISATI'!$D$14=8),UPPER(IF(K20=\"\",\"\",VLOOKUP(K20,[1]sema!$BA$14:$BI$20,9))),IF(AND(O20=\"m\",'[1]PODEŠAVANJA-NE BRISATI'!$D$13=16),UPPER(IF(K20=\"\",\"\",VLOOKUP(K20,[1]sema!$BA$22:$BI$36,9))),IF(AND(O20=\"z\",'[1]PODEŠAVANJA-NE BRISATI'!$D$14=16),UPPER(IF(K20=\"\",\"\",VLOOKUP(K20,[1]sema!$BA$37:$BI$51,9))),IF(AND(O20=\"m\",'[1]PODEŠAVANJA-NE BRISATI'!$D$13=32),UPPER(IF(K20=\"\",\"\",VLOOKUP(K20,[1]sema!$BA$53:$BI$83,9))),IF(AND(O20=\"z\",'[1]PODEŠAVANJA-NE BRISATI'!$D$14=32),UPPER(IF(K20=\"\",\"\",VLOOKUP(K20,[1]sema!$BA$84:$BI$114,9))),IF(AND(O20=\"m\",'[1]PODEŠAVANJA-NE BRISATI'!$D$13=64),UPPER(IF(K20=\"\",\"\",VLOOKUP(K20,[1]sema!$BA$116:$BI$178,9))),IF(AND(O20=\"z\",'[1]PODEŠAVANJA-NE BRISATI'!$D$14=64),UPPER(IF(K20=\"\",\"\",VLOOKUP(K20,[1]sema!$BA$179:$BI$241,9))),IF(AND(O20=\"mq\",'[1]PODEŠAVANJA-NE BRISATI'!$F$13=\"8>4\"),UPPER(IF(K20=\"\",\"\",VLOOKUP(K20,[1]sema!$BA$245:$BI$248,9))),IF(AND(O20=\"mq\",'[1]PODEŠAVANJA-NE BRISATI'!$F$13=\"16>4\"),UPPER(IF(K20=\"\",\"\",VLOOKUP(K20,[1]sema!$BA$254:$BI$265,9))),IF(AND(O20=\"mq\",'[1]PODEŠAVANJA-NE BRISATI'!$F$13=\"16>8\"),UPPER(IF(K20=\"\",\"\",VLOOKUP(K20,[1]sema!$BA$280:$BI$287,9))),IF(AND(O20=\"mq\",'[1]PODEŠAVANJA-NE BRISATI'!$F$13=\"32>4\"),UPPER(IF(K20=\"\",\"\",VLOOKUP(K20,[1]sema!$BA$298:$BI$325,9))),IF(AND(O20=\"mq\",'[1]PODEŠAVANJA-NE BRISATI'!$F$13=\"32>8\"),UPPER(IF(K20=\"\",\"\",VLOOKUP(K20,[1]sema!$BA$356:$BI$379,9))),IF(AND(O20=\"zq\",'[1]PODEŠAVANJA-NE BRISATI'!$F$14=\"8>4\"),UPPER(IF(K20=\"\",\"\",VLOOKUP(K20,[1]sema!$BA$249:$BI$252,9))),IF(AND(O20=\"zq\",'[1]PODEŠAVANJA-NE BRISATI'!$F$14=\"16>4\"),UPPER(IF(K20=\"\",\"\",VLOOKUP(K20,[1]sema!$BA$266:$BI$277,9))),IF(AND(O20=\"zq\",'[1]PODEŠAVANJA-NE BRISATI'!$F$14=\"16>8\"),UPPER(IF(K20=\"\",\"\",VLOOKUP(K20,[1]sema!$BA$288:$BI$295,9))),IF(AND(O20=\"zq\",'[1]PODEŠAVANJA-NE BRISATI'!$F$14=\"32>4\"),UPPER(IF(K20=\"\",\"\",VLOOKUP(K20,[1]sema!$BA$326:$BI$353,9))),IF(AND(O20=\"zq\",'[1]PODEŠAVANJA-NE BRISATI'!$F$14=\"32>8\"),UPPER(IF(K20=\"\",\"\",VLOOKUP(K20,[1]sema!$BA$380:$BI$403,9))),IF(AND(O20=\"md\",'[1]PODEŠAVANJA-NE BRISATI'!$E$13=4),UPPER(IF(K20=\"\",\"\",VLOOKUP(K20,[1]sema!$BA$406:$BK$408,11))),IF(AND(O20=\"zd\",'[1]PODEŠAVANJA-NE BRISATI'!$E$14=4),UPPER(IF(K20=\"\",\"\",VLOOKUP(K20,[1]sema!$BA$409:$BK$411,11))),IF(AND(O20=\"md\",'[1]PODEŠAVANJA-NE BRISATI'!$E$13=8),UPPER(IF(K20=\"\",\"\",VLOOKUP(K20,[1]sema!$BA$414:$BK$420,11))),IF(AND(O20=\"zd\",'[1]PODEŠAVANJA-NE BRISATI'!$E$14=8),UPPER(IF(K20=\"\",\"\",VLOOKUP(K20,[1]sema!$BA$421:$BK$427,11))),IF(AND(O20=\"md\",'[1]PODEŠAVANJA-NE BRISATI'!$E$13=16),UPPER(IF(K20=\"\",\"\",VLOOKUP(K20,[1]sema!$BA$430:$BK$444,11))),IF(AND(O20=\"zd\",'[1]PODEŠAVANJA-NE BRISATI'!$E$14=16),UPPER(IF(K20=\"\",\"\",VLOOKUP(K20,[1]sema!$BA$445:$BK$459,11))),\"\"))))))))))))))))))))))))","v":""}]
[null,null,null,null,null,"MEC 3",null,null,null,null,"MEC 4"]
[null,null,null,null,null,"NE PRE 13H",null,null,null,null,"NE PRE 13H"]
[null,null,null,null,"3. MEC",{"$f":"IF(ISBLANK(F28),\"\",IF(AND(J28=\"m\",'[1]PODEŠAVANJA-NE BRISATI'!$D$13=8),VLOOKUP(F28,[1]sema!$AX$7:$AY$13,2),IF(AND(J28=\"z\",'[1]PODEŠAVANJA-NE BRISATI'!$D$14=8),VLOOKUP(F28,[1]sema!$AX$14:$AY$20,2),IF(AND(J28=\"m\",'[1]PODEŠAVANJA-NE BRISATI'!$D$13=16),VLOOKUP(F28,[1]sema!$AX$22:$AY$36,2),IF(AND(J28=\"z\",'[1]PODEŠAVANJA-NE BRISATI'!$D$14=16),VLOOKUP(F28,[1]sema!$AX$37:$AY$51,2),IF(AND(J28=\"m\",'[1]PODEŠAVANJA-NE BRISATI'!$D$13=32),VLOOKUP(F28,[1]sema!$AX$53:$AY$83,2),IF(AND(J28=\"z\",'[1]PODEŠAVANJA-NE BRISATI'!$D$14=32),VLOOKUP(F28,[1]sema!$AX$84:$AY$114,2),IF(AND(J28=\"m\",'[1]PODEŠAVANJA-NE BRISATI'!$D$13=64),VLOOKUP(F28,[1]sema!$AX$116:$AY$178,2),IF(AND(J28=\"z\",'[1]PODEŠAVANJA-NE BRISATI'!$D$14=64),VLOOKUP(F28,[1]sema!$AX$179:$AY$241,2),IF(AND(J28=\"mq\",'[1]PODEŠAVANJA-NE BRISATI'!$F$13=\"8>4\"),VLOOKUP(F28,[1]sema!$AX$245:$AY$248,2),IF(AND(J28=\"zq\",'[1]PODEŠAVANJA-NE BRISATI'!$F$14=\"8>4\"),VLOOKUP(F28,[1]sema!$AX$249:$AY$252,2),IF(AND(J28=\"mq\",'[1]PODEŠAVANJA-NE BRISATI'!$F$13=\"16>4\"),VLOOKUP(F28,[1]sema!$AX$254:$AY$265,2),IF(AND(J28=\"zq\",'[1]PODEŠAVANJA-NE BRISATI'!$F$14=\"16>4\"),VLOOKUP(F28,[1]sema!$AX$266:$AY$277,2),IF(AND(J28=\"mq\",'[1]PODEŠAVANJA-NE BRISATI'!$F$13=\"16>8\"),VLOOKUP(F28,[1]sema!$AX$280:$AY$287,2),IF(AND(J28=\"zq\",'[1]PODEŠAVANJA-NE BRISATI'!$F$14=\"16>8\"),VLOOKUP(F28,[1]sema!$AX$288:$AY$295,2),IF(AND(J28=\"mq\",'[1]PODEŠAVANJA-NE BRISATI'!$F$13=\"32>4\"),VLOOKUP(F28,[1]sema!$AX$298:$AY$325,2),IF(AND(J28=\"zq\",'[1]PODEŠAVANJA-NE BRISATI'!$F$14=\"32>4\"),VLOOKUP(F28,[1]sema!$AX$326:$AY$353,2),IF(AND(J28=\"mq\",'[1]PODEŠAVANJA-NE BRISATI'!$F$13=\"32>8\"),VLOOKUP(F28,[1]sema!$AX$356:$AY$379,2),IF(AND(J28=\"zq\",'[1]PODEŠAVANJA-NE BRISATI'!$F$14=\"32>8\"),VLOOKUP(F28,[1]sema!$AX$380:$AY$403,2),IF(AND(J28=\"md\",'[1]PODEŠAVANJA-NE BRISATI'!$E$13=4),VLOOKUP(F28,[1]sema!$AX$406:$AY$408,2),IF(AND(J28=\"zd\",'[1]PODEŠAVANJA-NE BRISATI'!$E$14=4),VLOOKUP(F28,[1]sema!$AX$409:$AY$411,2),IF(AND(J28=\"md\",'[1]PODEŠAVANJA-NE BRISATI'!$E$13=8),VLOOKUP(F28,[1]sema!$AX$414:$AY$420,2),IF(AND(J28=\"zd\",'[1]PODEŠAVANJA-NE BRISATI'!$E$14=8),VLOOKUP(F28,[1]sema!$AX$421:$AY$427,2),IF(AND(J28=\"md\",'[1]PODEŠAVANJA-NE BRISATI'!$E$13=16),VLOOKUP(F28,[1]sema!$AX$430:$AY$444,2),IF(AND(J28=\"zd\",'[1]PODEŠAVANJA-NE BRISATI'!$E$14=8),VLOOKUP(F28,[1]sema!$AX$445:$AY$459,2))))))))))))))))))))))))))","v":""},null,null,null,null,{"$f":"IF(ISBLANK(K28),\"\",IF(AND(O28=\"m\",'[1]PODEŠAVANJA-NE BRISATI'!$D$13=8),VLOOKUP(K28,[1]sema!$AX$7:$AY$13,2),IF(AND(O28=\"z\",'[1]PODEŠAVANJA-NE BRISATI'!$D$14=8),VLOOKUP(K28,[1]sema!$AX$14:$AY$20,2),IF(AND(O28=\"m\",'[1]PODEŠAVANJA-NE BRISATI'!$D$13=16),VLOOKUP(K28,[1]sema!$AX$22:$AY$36,2),IF(AND(O28=\"z\",'[1]PODEŠAVANJA-NE BRISATI'!$D$14=16),VLOOKUP(K28,[1]sema!$AX$37:$AY$51,2),IF(AND(O28=\"m\",'[1]PODEŠAVANJA-NE BRISATI'!$D$13=32),VLOOKUP(K28,[1]sema!$AX$53:$AY$83,2),IF(AND(O28=\"z\",'[1]PODEŠAVANJA-NE BRISATI'!$D$14=32),VLOOKUP(K28,[1]sema!$AX$84:$AY$114,2),IF(AND(O28=\"m\",'[1]PODEŠAVANJA-NE BRISATI'!$D$13=64),VLOOKUP(K28,[1]sema!$AX$116:$AY$178,2),IF(AND(O28=\"z\",'[1]PODEŠAVANJA-NE BRISATI'!$D$14=64),VLOOKUP(K28,[1]sema!$AX$179:$AY$241,2),IF(AND(O28=\"mq\",'[1]PODEŠAVANJA-NE BRISATI'!$F$13=\"8>4\"),VLOOKUP(K28,[1]sema!$AX$245:$AY$248,2),IF(AND(O28=\"zq\",'[1]PODEŠAVANJA-NE BRISATI'!$F$14=\"8>4\"),VLOOKUP(K28,[1]sema!$AX$249:$AY$252,2),IF(AND(O28=\"mq\",'[1]PODEŠAVANJA-NE BRISATI'!$F$13=\"16>4\"),VLOOKUP(K28,[1]sema!$AX$254:$AY$265,2),IF(AND(O28=\"zq\",'[1]PODEŠAVANJA-NE BRISATI'!$F$14=\"16>4\"),VLOOKUP(K28,[1]sema!$AX$266:$AY$277,2),IF(AND(O28=\"mq\",'[1]PODEŠAVANJA-NE BRISATI'!$F$13=\"16>8\"),VLOOKUP(K28,[1]sema!$AX$280:$AY$287,2),IF(AND(O28=\"zq\",'[1]PODEŠAVANJA-NE BRISATI'!$F$14=\"16>8\"),VLOOKUP(K28,[1]sema!$AX$288:$AY$295,2),IF(AND(O28=\"mq\",'[1]PODEŠAVANJA-NE BRISATI'!$F$13=\"32>4\"),VLOOKUP(K28,[1]sema!$AX$298:$AY$325,2),IF(AND(O28=\"zq\",'[1]PODEŠAVANJA-NE BRISATI'!$F$14=\"32>4\"),VLOOKUP(K28,[1]sema!$AX$326:$AY$353,2),IF(AND(O28=\"mq\",'[1]PODEŠAVANJA-NE BRISATI'!$F$13=\"32>8\"),VLOOKUP(K28,[1]sema!$AX$356:$AY$379,2),IF(AND(O28=\"zq\",'[1]PODEŠAVANJA-NE BRISATI'!$F$14=\"32>8\"),VLOOKUP(K28,[1]sema!$AX$380:$AY$403,2),IF(AND(O28=\"md\",'[1]PODEŠAVANJA-NE BRISATI'!$E$13=4),VLOOKUP(K28,[1]sema!$AX$406:$AY$408,2),IF(AND(O28=\"zd\",'[1]PODEŠAVANJA-NE BRISATI'!$E$14=4),VLOOKUP(K28,[1]sema!$AX$409:$AY$411,2),IF(AND(O28=\"md\",'[1]PODEŠAVANJA-NE BRISATI'!$E$13=8),VLOOKUP(K28,[1]sema!$AX$414:$AY$420,2),IF(AND(O28=\"zd\",'[1]PODEŠAVANJA-NE BRISATI'!$E$14=8),VLOOKUP(K28,[1]sema!$AX$421:$AY$427,2),IF(AND(O28=\"md\",'[1]PODEŠAVANJA-NE BRISATI'!$E$13=16),VLOOKUP(K28,[1]sema!$AX$430:$AY$444,2),IF(AND(O28=\"zd\",'[1]PODEŠAVANJA-NE BRISATI'!$E$14=8),VLOOKUP(K28,[1]sema!$AX$445:$AY$459,2))))))))))))))))))))))))))","v":""}]
[null,null,null,null,null,{"$f":"IF(AND(J28=\"m\",'[1]PODEŠAVANJA-NE BRISATI'!$D$13=8),UPPER(IF(F28=\"\",\"\",VLOOKUP(F28,[1]sema!$BA$7:$BI$13,8))),IF(AND(J28=\"z\",'[1]PODEŠAVANJA-NE BRISATI'!$D$14=8),UPPER(IF(F28=\"\",\"\",VLOOKUP(F28,[1]sema!$BA$14:$BI$20,8))),IF(AND(J28=\"m\",'[1]PODEŠAVANJA-NE BRISATI'!$D$13=16),UPPER(IF(F28=\"\",\"\",VLOOKUP(F28,[1]sema!$BA$22:$BI$36,8))),IF(AND(J28=\"z\",'[1]PODEŠAVANJA-NE BRISATI'!$D$14=16),UPPER(IF(F28=\"\",\"\",VLOOKUP(F28,[1]sema!$BA$37:$BI$51,8))),IF(AND(J28=\"m\",'[1]PODEŠAVANJA-NE BRISATI'!$D$13=32),UPPER(IF(F28=\"\",\"\",VLOOKUP(F28,[1]sema!$BA$53:$BI$83,8))),IF(AND(J28=\"z\",'[1]PODEŠAVANJA-NE BRISATI'!$D$14=32),UPPER(IF(F28=\"\",\"\",VLOOKUP(F28,[1]sema!$BA$84:$BI$114,8))),IF(AND(J28=\"m\",'[1]PODEŠAVANJA-NE BRISATI'!$D$13=64),UPPER(IF(F28=\"\",\"\",VLOOKUP(F28,[1]sema!$BA$116:$BI$178,8))),IF(AND(J28=\"z\",'[1]PODEŠAVANJA-NE BRISATI'!$D$14=64),UPPER(IF(F28=\"\",\"\",VLOOKUP(F28,[1]sema!$BA$179:$BI$241,8))),IF(AND(J28=\"mq\",'[1]PODEŠAVANJA-NE BRISATI'!$F$13=\"8>4\"),UPPER(IF(F28=\"\",\"\",VLOOKUP(F28,[1]sema!$BA$245:$BI$248,8))),IF(AND(J28=\"mq\",'[1]PODEŠAVANJA-NE BRISATI'!$F$13=\"16>4\"),UPPER(IF(F28=\"\",\"\",VLOOKUP(F28,[1]sema!$BA$254:$BI$265,8))),IF(AND(J28=\"mq\",'[1]PODEŠAVANJA-NE BRISATI'!$F$13=\"16>8\"),UPPER(IF(F28=\"\",\"\",VLOOKUP(F28,[1]sema!$BA$280:$BI$287,8))),IF(AND(J28=\"mq\",'[1]PODEŠAVANJA-NE BRISATI'!$F$13=\"32>4\"),UPPER(IF(F28=\"\",\"\",VLOOKUP(F28,[1]sema!$BA$298:$BI$325,8))),IF(AND(J28=\"mq\",'[1]PODEŠAVANJA-NE BRISATI'!$F$13=\"32>8\"),UPPER(IF(F28=\"\",\"\",VLOOKUP(F28,[1]sema!$BA$356:$BI$379,8))),IF(AND(J28=\"zq\",'[1]PODEŠAVANJA-NE BRISATI'!$F$14=\"8>4\"),UPPER(IF(F28=\"\",\"\",VLOOKUP(F28,[1]sema!$BA$249:$BI$252,8))),IF(AND(J28=\"zq\",'[1]PODEŠAVANJA-NE BRISATI'!$F$14=\"16>4\"),UPPER(IF(F28=\"\",\"\",VLOOKUP(F28,[1]sema!$BA$266:$BI$277,8))),IF(AND(J28=\"zq\",'[1]PODEŠAVANJA-NE BRISATI'!$F$14=\"16>8\"),UPPER(IF(F28=\"\",\"\",VLOOKUP(F28,[1]sema!$BA$288:$BI$295,8))),IF(AND(J28=\"zq\",'[1]PODEŠAVANJA-NE BRISATI'!$F$14=\"32>4\"),UPPER(IF(F28=\"\",\"\",VLOOKUP(F28,[1]sema!$BA$326:$BI$353,8))),IF(AND(J28=\"zq\",'[1]PODEŠAVANJA-NE BRISATI'!$F$14=\"32>8\"),UPPER(IF(F28=\"\",\"\",VLOOKUP(F28,[1]sema!$BA$380:$BI$403,8))),IF(AND(J28=\"md\",'[1]PODEŠAVANJA-NE BRISATI'!$E$13=4),UPPER(IF(F28=\"\",\"\",VLOOKUP(F28,[1]sema!$BA$406:$BK$408,8))),IF(AND(J28=\"zd\",'[1]PODEŠAVANJA-NE BRISATI'!$E$14=4),UPPER(IF(F28=\"\",\"\",VLOOKUP(F28,[1]sema!$BA$409:$BK$411,8))),IF(AND(J28=\"md\",'[1]PODEŠAVANJA-NE BRISATI'!$E$13=8),UPPER(IF(F28=\"\",\"\",VLOOKUP(F28,[1]sema!$BA$414:$BK$420,8))),IF(AND(J28=\"zd\",'[1]PODEŠAVANJA-NE BRISATI'!$E$14=8),UPPER(IF(F28=\"\",\"\",VLOOKUP(F28,[1]sema!$BA$421:$BK$427,8))),IF(AND(J28=\"md\",'[1]PODEŠAVANJA-NE BRISATI'!$E$13=16),UPPER(IF(F28=\"\",\"\",VLOOKUP(F28,[1]sema!$BA$430:$BK$444,8))),IF(AND(J28=\"zd\",'[1]PODEŠAVANJA-NE BRISATI'!$E$14=16),UPPER(IF(F28=\"\",\"\",VLOOKUP(F28,[1]sema!$BA$445:$BK$459,8))),\"\"))))))))))))))))))))))))","v":""}]
[null,null,null,null,null,{"$f":"'Zreb CEO 10'!H10","v":"Djordevic Veljko (AST)"}]
[null,null,null,null,null,null,"vs.",null,null,{"$f":"MID(F28,3,2)","v":""},null,"vs.",null,null,{"$f":"MID(K28,3,2)","v":""}]
[null,null,null,null,null,{"$f":"'Zreb CEO 10'!P10","v":0}]
[null,null,null,null,null,{"$f":"IF(AND(J28=\"m\",'[1]PODEŠAVANJA-NE BRISATI'!$D$13=8),UPPER(IF(F28=\"\",\"\",VLOOKUP(F28,[1]sema!$BA$7:$BI$13,9))),IF(AND(J28=\"z\",'[1]PODEŠAVANJA-NE BRISATI'!$D$14=8),UPPER(IF(F28=\"\",\"\",VLOOKUP(F28,[1]sema!$BA$14:$BI$20,9))),IF(AND(J28=\"m\",'[1]PODEŠAVANJA-NE BRISATI'!$D$13=16),UPPER(IF(F28=\"\",\"\",VLOOKUP(F28,[1]sema!$BA$22:$BI$36,9))),IF(AND(J28=\"z\",'[1]PODEŠAVANJA-NE BRISATI'!$D$14=16),UPPER(IF(F28=\"\",\"\",VLOOKUP(F28,[1]sema!$BA$37:$BI$51,9))),IF(AND(J28=\"m\",'[1]PODEŠAVANJA-NE BRISATI'!$D$13=32),UPPER(IF(F28=\"\",\"\",VLOOKUP(F28,[1]sema!$BA$53:$BI$83,9))),IF(AND(J28=\"z\",'[1]PODEŠAVANJA-NE BRISATI'!$D$14=32),UPPER(IF(F28=\"\",\"\",VLOOKUP(F28,[1]sema!$BA$84:$BI$114,9))),IF(AND(J28=\"m\",'[1]PODEŠAVANJA-NE BRISATI'!$D$13=64),UPPER(IF(F28=\"\",\"\",VLOOKUP(F28,[1]sema!$BA$116:$BI$178,9))),IF(AND(J28=\"z\",'[1]PODEŠAVANJA-NE BRISATI'!$D$14=64),UPPER(IF(F28=\"\",\"\",VLOOKUP(F28,[1]sema!$BA$179:$BI$241,9))),IF(AND(J28=\"mq\",'[1]PODEŠAVANJA-NE BRISATI'!$F$13=\"8>4\"),UPPER(IF(F28=\"\",\"\",VLOOKUP(F28,[1]sema!$BA$245:$BI$248,9))),IF(AND(J28=\"mq\",'[1]PODEŠAVANJA-NE BRISATI'!$F$13=\"16>4\"),UPPER(IF(F28=\"\",\"\",VLOOKUP(F28,[1]sema!$BA$254:$BI$265,9))),IF(AND(J28=\"mq\",'[1]PODEŠAVANJA-NE BRISATI'!$F$13=\"16>8\"),UPPER(IF(F28=\"\",\"\",VLOOKUP(F28,[1]sema!$BA$280:$BI$287,9))),IF(AND(J28=\"mq\",'[1]PODEŠAVANJA-NE BRISATI'!$F$13=\"32>4\"),UPPER(IF(F28=\"\",\"\",VLOOKUP(F28,[1]sema!$BA$298:$BI$325,9))),IF(AND(J28=\"mq\",'[1]PODEŠAVANJA-NE BRISATI'!$F$13=\"32>8\"),UPPER(IF(F28=\"\",\"\",VLOOKUP(F28,[1]sema!$BA$356:$BI$379,9))),IF(AND(J28=\"zq\",'[1]PODEŠAVANJA-NE BRISATI'!$F$14=\"8>4\"),UPPER(IF(F28=\"\",\"\",VLOOKUP(F28,[1]sema!$BA$249:$BI$252,9))),IF(AND(J28=\"zq\",'[1]PODEŠAVANJA-NE BRISATI'!$F$14=\"16>4\"),UPPER(IF(F28=\"\",\"\",VLOOKUP(F28,[1]sema!$BA$266:$BI$277,9))),IF(AND(J28=\"zq\",'[1]PODEŠAVANJA-NE BRISATI'!$F$14=\"16>8\"),UPPER(IF(F28=\"\",\"\",VLOOKUP(F28,[1]sema!$BA$288:$BI$295,9))),IF(AND(J28=\"zq\",'[1]PODEŠAVANJA-NE BRISATI'!$F$14=\"32>4\"),UPPER(IF(F28=\"\",\"\",VLOOKUP(F28,[1]sema!$BA$326:$BI$353,9))),IF(AND(J28=\"zq\",'[1]PODEŠAVANJA-NE BRISATI'!$F$14=\"32>8\"),UPPER(IF(F28=\"\",\"\",VLOOKUP(F28,[1]sema!$BA$380:$BI$403,9))),IF(AND(J28=\"md\",'[1]PODEŠAVANJA-NE BRISATI'!$E$13=4),UPPER(IF(F28=\"\",\"\",VLOOKUP(F28,[1]sema!$BA$406:$BK$408,11))),IF(AND(J28=\"zd\",'[1]PODEŠAVANJA-NE BRISATI'!$E$14=4),UPPER(IF(F28=\"\",\"\",VLOOKUP(F28,[1]sema!$BA$409:$BK$411,11))),IF(AND(J28=\"md\",'[1]PODEŠAVANJA-NE BRISATI'!$E$13=8),UPPER(IF(F28=\"\",\"\",VLOOKUP(F28,[1]sema!$BA$414:$BK$420,11))),IF(AND(J28=\"zd\",'[1]PODEŠAVANJA-NE BRISATI'!$E$14=8),UPPER(IF(F28=\"\",\"\",VLOOKUP(F28,[1]sema!$BA$421:$BK$427,11))),IF(AND(J28=\"md\",'[1]PODEŠAVANJA-NE BRISATI'!$E$13=16),UPPER(IF(F28=\"\",\"\",VLOOKUP(F28,[1]sema!$BA$430:$BK$444,11))),IF(AND(J28=\"zd\",'[1]PODEŠAVANJA-NE BRISATI'!$E$14=16),UPPER(IF(F28=\"\",\"\",VLOOKUP(F28,[1]sema!$BA$445:$BK$459,11))),\"\"))))))))))))))))))))))))","v":""}]
[null,null,null,null,null,"MEC 5"]
[null,null,null,null,null,"NE PRE 14H",null,null,null,null,"NE PRE 14H"]
[null,null,null,null,"4. MEC",{"$f":"IF(ISBLANK(F36),\"\",IF(AND(J36=\"m\",'[1]PODEŠAVANJA-NE BRISATI'!$D$13=8),VLOOKUP(F36,[1]sema!$AX$7:$AY$13,2),IF(AND(J36=\"z\",'[1]PODEŠAVANJA-NE BRISATI'!$D$14=8),VLOOKUP(F36,[1]sema!$AX$14:$AY$20,2),IF(AND(J36=\"m\",'[1]PODEŠAVANJA-NE BRISATI'!$D$13=16),VLOOKUP(F36,[1]sema!$AX$22:$AY$36,2),IF(AND(J36=\"z\",'[1]PODEŠAVANJA-NE BRISATI'!$D$14=16),VLOOKUP(F36,[1]sema!$AX$37:$AY$51,2),IF(AND(J36=\"m\",'[1]PODEŠAVANJA-NE BRISATI'!$D$13=32),VLOOKUP(F36,[1]sema!$AX$53:$AY$83,2),IF(AND(J36=\"z\",'[1]PODEŠAVANJA-NE BRISATI'!$D$14=32),VLOOKUP(F36,[1]sema!$AX$84:$AY$114,2),IF(AND(J36=\"m\",'[1]PODEŠAVANJA-NE BRISATI'!$D$13=64),VLOOKUP(F36,[1]sema!$AX$116:$AY$178,2),IF(AND(J36=\"z\",'[1]PODEŠAVANJA-NE BRISATI'!$D$14=64),VLOOKUP(F36,[1]sema!$AX$179:$AY$241,2),IF(AND(J36=\"mq\",'[1]PODEŠAVANJA-NE BRISATI'!$F$13=\"8>4\"),VLOOKUP(F36,[1]sema!$AX$245:$AY$248,2),IF(AND(J36=\"zq\",'[1]PODEŠAVANJA-NE BRISATI'!$F$14=\"8>4\"),VLOOKUP(F36,[1]sema!$AX$249:$AY$252,2),IF(AND(J36=\"mq\",'[1]PODEŠAVANJA-NE BRISATI'!$F$13=\"16>4\"),VLOOKUP(F36,[1]sema!$AX$254:$AY$265,2),IF(AND(J36=\"zq\",'[1]PODEŠAVANJA-NE BRISATI'!$F$14=\"16>4\"),VLOOKUP(F36,[1]sema!$AX$266:$AY$277,2),IF(AND(J36=\"mq\",'[1]PODEŠAVANJA-NE BRISATI'!$F$13=\"16>8\"),VLOOKUP(F36,[1]sema!$AX$280:$AY$287,2),IF(AND(J36=\"zq\",'[1]PODEŠAVANJA-NE BRISATI'!$F$14=\"16>8\"),VLOOKUP(F36,[1]sema!$AX$288:$AY$295,2),IF(AND(J36=\"mq\",'[1]PODEŠAVANJA-NE BRISATI'!$F$13=\"32>4\"),VLOOKUP(F36,[1]sema!$AX$298:$AY$325,2),IF(AND(J36=\"zq\",'[1]PODEŠAVANJA-NE BRISATI'!$F$14=\"32>4\"),VLOOKUP(F36,[1]sema!$AX$326:$AY$353,2),IF(AND(J36=\"mq\",'[1]PODEŠAVANJA-NE BRISATI'!$F$13=\"32>8\"),VLOOKUP(F36,[1]sema!$AX$356:$AY$379,2),IF(AND(J36=\"zq\",'[1]PODEŠAVANJA-NE BRISATI'!$F$14=\"32>8\"),VLOOKUP(F36,[1]sema!$AX$380:$AY$403,2),IF(AND(J36=\"md\",'[1]PODEŠAVANJA-NE BRISATI'!$E$13=4),VLOOKUP(F36,[1]sema!$AX$406:$AY$408,2),IF(AND(J36=\"zd\",'[1]PODEŠAVANJA-NE BRISATI'!$E$14=4),VLOOKUP(F36,[1]sema!$AX$409:$AY$411,2),IF(AND(J36=\"md\",'[1]PODEŠAVANJA-NE BRISATI'!$E$13=8),VLOOKUP(F36,[1]sema!$AX$414:$AY$420,2),IF(AND(J36=\"zd\",'[1]PODEŠAVANJA-NE BRISATI'!$E$14=8),VLOOKUP(F36,[1]sema!$AX$421:$AY$427,2),IF(AND(J36=\"md\",'[1]PODEŠAVANJA-NE BRISATI'!$E$13=16),VLOOKUP(F36,[1]sema!$AX$430:$AY$444,2),IF(AND(J36=\"zd\",'[1]PODEŠAVANJA-NE BRISATI'!$E$14=8),VLOOKUP(F36,[1]sema!$AX$445:$AY$459,2))))))))))))))))))))))))))","v":""},null,null,null,null,{"$f":"IF(ISBLANK(K36),\"\",IF(AND(O36=\"m\",'[1]PODEŠAVANJA-NE BRISATI'!$D$13=8),VLOOKUP(K36,[1]sema!$AX$7:$AY$13,2),IF(AND(O36=\"z\",'[1]PODEŠAVANJA-NE BRISATI'!$D$14=8),VLOOKUP(K36,[1]sema!$AX$14:$AY$20,2),IF(AND(O36=\"m\",'[1]PODEŠAVANJA-NE BRISATI'!$D$13=16),VLOOKUP(K36,[1]sema!$AX$22:$AY$36,2),IF(AND(O36=\"z\",'[1]PODEŠAVANJA-NE BRISATI'!$D$14=16),VLOOKUP(K36,[1]sema!$AX$37:$AY$51,2),IF(AND(O36=\"m\",'[1]PODEŠAVANJA-NE BRISATI'!$D$13=32),VLOOKUP(K36,[1]sema!$AX$53:$AY$83,2),IF(AND(O36=\"z\",'[1]PODEŠAVANJA-NE BRISATI'!$D$14=32),VLOOKUP(K36,[1]sema!$AX$84:$AY$114,2),IF(AND(O36=\"m\",'[1]PODEŠAVANJA-NE BRISATI'!$D$13=64),VLOOKUP(K36,[1]sema!$AX$116:$AY$178,2),IF(AND(O36=\"z\",'[1]PODEŠAVANJA-NE BRISATI'!$D$14=64),VLOOKUP(K36,[1]sema!$AX$179:$AY$241,2),IF(AND(O36=\"mq\",'[1]PODEŠAVANJA-NE BRISATI'!$F$13=\"8>4\"),VLOOKUP(K36,[1]sema!$AX$245:$AY$248,2),IF(AND(O36=\"zq\",'[1]PODEŠAVANJA-NE BRISATI'!$F$14=\"8>4\"),VLOOKUP(K36,[1]sema!$AX$249:$AY$252,2),IF(AND(O36=\"mq\",'[1]PODEŠAVANJA-NE BRISATI'!$F$13=\"16>4\"),VLOOKUP(K36,[1]sema!$AX$254:$AY$265,2),IF(AND(O36=\"zq\",'[1]PODEŠAVANJA-NE BRISATI'!$F$14=\"16>4\"),VLOOKUP(K36,[1]sema!$AX$266:$AY$277,2),IF(AND(O36=\"mq\",'[1]PODEŠAVANJA-NE BRISATI'!$F$13=\"16>8\"),VLOOKUP(K36,[1]sema!$AX$280:$AY$287,2),IF(AND(O36=\"zq\",'[1]PODEŠAVANJA-NE BRISATI'!$F$14=\"16>8\"),VLOOKUP(K36,[1]sema!$AX$288:$AY$295,2),IF(AND(O36=\"mq\",'[1]PODEŠAVANJA-NE BRISATI'!$F$13=\"32>4\"),VLOOKUP(K36,[1]sema!$AX$298:$AY$325,2),IF(AND(O36=\"zq\",'[1]PODEŠAVANJA-NE BRISATI'!$F$14=\"32>4\"),VLOOKUP(K36,[1]sema!$AX$326:$AY$353,2),IF(AND(O36=\"mq\",'[1]PODEŠAVANJA-NE BRISATI'!$F$13=\"32>8\"),VLOOKUP(K36,[1]sema!$AX$356:$AY$379,2),IF(AND(O36=\"zq\",'[1]PODEŠAVANJA-NE BRISATI'!$F$14=\"32>8\"),VLOOKUP(K36,[1]sema!$AX$380:$AY$403,2),IF(AND(O36=\"md\",'[1]PODEŠAVANJA-NE BRISATI'!$E$13=4),VLOOKUP(K36,[1]sema!$AX$406:$AY$408,2),IF(AND(O36=\"zd\",'[1]PODEŠAVANJA-NE BRISATI'!$E$14=4),VLOOKUP(K36,[1]sema!$AX$409:$AY$411,2),IF(AND(O36=\"md\",'[1]PODEŠAVANJA-NE BRISATI'!$E$13=8),VLOOKUP(K36,[1]sema!$AX$414:$AY$420,2),IF(AND(O36=\"zd\",'[1]PODEŠAVANJA-NE BRISATI'!$E$14=8),VLOOKUP(K36,[1]sema!$AX$421:$AY$427,2),IF(AND(O36=\"md\",'[1]PODEŠAVANJA-NE BRISATI'!$E$13=16),VLOOKUP(K36,[1]sema!$AX$430:$AY$444,2),IF(AND(O36=\"zd\",'[1]PODEŠAVANJA-NE BRISATI'!$E$14=8),VLOOKUP(K36,[1]sema!$AX$445:$AY$459,2))))))))))))))))))))))))))","v":""}]
[null,null,null,null,null,null,null,null,null,null,{"$f":"IF(AND(O36=\"m\",'[1]PODEŠAVANJA-NE BRISATI'!$D$13=8),UPPER(IF(K36=\"\",\"\",VLOOKUP(K36,[1]sema!$BA$7:$BI$13,8))),IF(AND(O36=\"z\",'[1]PODEŠAVANJA-NE BRISATI'!$D$14=8),UPPER(IF(K36=\"\",\"\",VLOOKUP(K36,[1]sema!$BA$14:$BI$20,8))),IF(AND(O36=\"m\",'[1]PODEŠAVANJA-NE BRISATI'!$D$13=16),UPPER(IF(K36=\"\",\"\",VLOOKUP(K36,[1]sema!$BA$22:$BI$36,8))),IF(AND(O36=\"z\",'[1]PODEŠAVANJA-NE BRISATI'!$D$14=16),UPPER(IF(K36=\"\",\"\",VLOOKUP(K36,[1]sema!$BA$37:$BI$51,8))),IF(AND(O36=\"m\",'[1]PODEŠAVANJA-NE BRISATI'!$D$13=32),UPPER(IF(K36=\"\",\"\",VLOOKUP(K36,[1]sema!$BA$53:$BI$83,8))),IF(AND(O36=\"z\",'[1]PODEŠAVANJA-NE BRISATI'!$D$14=32),UPPER(IF(K36=\"\",\"\",VLOOKUP(K36,[1]sema!$BA$84:$BI$114,8))),IF(AND(O36=\"m\",'[1]PODEŠAVANJA-NE BRISATI'!$D$13=64),UPPER(IF(K36=\"\",\"\",VLOOKUP(K36,[1]sema!$BA$116:$BI$178,8))),IF(AND(O36=\"z\",'[1]PODEŠAVANJA-NE BRISATI'!$D$14=64),UPPER(IF(K36=\"\",\"\",VLOOKUP(K36,[1]sema!$BA$179:$BI$241,8))),IF(AND(O36=\"mq\",'[1]PODEŠAVANJA-NE BRISATI'!$F$13=\"8>4\"),UPPER(IF(K36=\"\",\"\",VLOOKUP(K36,[1]sema!$BA$245:$BI$248,8))),IF(AND(O36=\"mq\",'[1]PODEŠAVANJA-NE BRISATI'!$F$13=\"16>4\"),UPPER(IF(K36=\"\",\"\",VLOOKUP(K36,[1]sema!$BA$254:$BI$265,8))),IF(AND(O36=\"mq\",'[1]PODEŠAVANJA-NE BRISATI'!$F$13=\"16>8\"),UPPER(IF(K36=\"\",\"\",VLOOKUP(K36,[1]sema!$BA$280:$BI$287,8))),IF(AND(O36=\"mq\",'[1]PODEŠAVANJA-NE BRISATI'!$F$13=\"32>4\"),UPPER(IF(K36=\"\",\"\",VLOOKUP(K36,[1]sema!$BA$298:$BI$325,8))),IF(AND(O36=\"mq\",'[1]PODEŠAVANJA-NE BRISATI'!$F$13=\"32>8\"),UPPER(IF(K36=\"\",\"\",VLOOKUP(K36,[1]sema!$BA$356:$BI$379,8))),IF(AND(O36=\"zq\",'[1]PODEŠAVANJA-NE BRISATI'!$F$14=\"8>4\"),UPPER(IF(K36=\"\",\"\",VLOOKUP(K36,[1]sema!$BA$249:$BI$252,8))),IF(AND(O36=\"zq\",'[1]PODEŠAVANJA-NE BRISATI'!$F$14=\"16>4\"),UPPER(IF(K36=\"\",\"\",VLOOKUP(K36,[1]sema!$BA$266:$BI$277,8))),IF(AND(O36=\"zq\",'[1]PODEŠAVANJA-NE BRISATI'!$F$14=\"16>8\"),UPPER(IF(K36=\"\",\"\",VLOOKUP(K36,[1]sema!$BA$288:$BI$295,8))),IF(AND(O36=\"zq\",'[1]PODEŠAVANJA-NE BRISATI'!$F$14=\"32>4\"),UPPER(IF(K36=\"\",\"\",VLOOKUP(K36,[1]sema!$BA$326:$BI$353,8))),IF(AND(O36=\"zq\",'[1]PODEŠAVANJA-NE BRISATI'!$F$14=\"32>8\"),UPPER(IF(K36=\"\",\"\",VLOOKUP(K36,[1]sema!$BA$380:$BI$403,8))),IF(AND(O36=\"md\",'[1]PODEŠAVANJA-NE BRISATI'!$E$13=4),UPPER(IF(K36=\"\",\"\",VLOOKUP(K36,[1]sema!$BA$406:$BK$408,8))),IF(AND(O36=\"zd\",'[1]PODEŠAVANJA-NE BRISATI'!$E$14=4),UPPER(IF(K36=\"\",\"\",VLOOKUP(K36,[1]sema!$BA$409:$BK$411,8))),IF(AND(O36=\"md\",'[1]PODEŠAVANJA-NE BRISATI'!$E$13=8),UPPER(IF(K36=\"\",\"\",VLOOKUP(K36,[1]sema!$BA$414:$BK$420,8))),IF(AND(O36=\"zd\",'[1]PODEŠAVANJA-NE BRISATI'!$E$14=8),UPPER(IF(K36=\"\",\"\",VLOOKUP(K36,[1]sema!$BA$421:$BK$427,8))),IF(AND(O36=\"md\",'[1]PODEŠAVANJA-NE BRISATI'!$E$13=16),UPPER(IF(K36=\"\",\"\",VLOOKUP(K36,[1]sema!$BA$430:$BK$444,8))),IF(AND(O36=\"zd\",'[1]PODEŠAVANJA-NE BRISATI'!$E$14=16),UPPER(IF(K36=\"\",\"\",VLOOKUP(K36,[1]sema!$BA$445:$BK$459,8))),\"\"))))))))))))))))))))))))","v":""}]
[]
[null,null,null,null,null,null,"vs.",null,null,{"$f":"MID(F36,3,2)","v":""},null,"vs.",null,null,{"$f":"MID(K36,3,2)","v":""}]
[]
[null,null,null,null,null,null,null,null,null,null,{"$f":"IF(AND(O36=\"m\",'[1]PODEŠAVANJA-NE BRISATI'!$D$13=8),UPPER(IF(K36=\"\",\"\",VLOOKUP(K36,[1]sema!$BA$7:$BI$13,9))),IF(AND(O36=\"z\",'[1]PODEŠAVANJA-NE BRISATI'!$D$14=8),UPPER(IF(K36=\"\",\"\",VLOOKUP(K36,[1]sema!$BA$14:$BI$20,9))),IF(AND(O36=\"m\",'[1]PODEŠAVANJA-NE BRISATI'!$D$13=16),UPPER(IF(K36=\"\",\"\",VLOOKUP(K36,[1]sema!$BA$22:$BI$36,9))),IF(AND(O36=\"z\",'[1]PODEŠAVANJA-NE BRISATI'!$D$14=16),UPPER(IF(K36=\"\",\"\",VLOOKUP(K36,[1]sema!$BA$37:$BI$51,9))),IF(AND(O36=\"m\",'[1]PODEŠAVANJA-NE BRISATI'!$D$13=32),UPPER(IF(K36=\"\",\"\",VLOOKUP(K36,[1]sema!$BA$53:$BI$83,9))),IF(AND(O36=\"z\",'[1]PODEŠAVANJA-NE BRISATI'!$D$14=32),UPPER(IF(K36=\"\",\"\",VLOOKUP(K36,[1]sema!$BA$84:$BI$114,9))),IF(AND(O36=\"m\",'[1]PODEŠAVANJA-NE BRISATI'!$D$13=64),UPPER(IF(K36=\"\",\"\",VLOOKUP(K36,[1]sema!$BA$116:$BI$178,9))),IF(AND(O36=\"z\",'[1]PODEŠAVANJA-NE BRISATI'!$D$14=64),UPPER(IF(K36=\"\",\"\",VLOOKUP(K36,[1]sema!$BA$179:$BI$241,9))),IF(AND(O36=\"mq\",'[1]PODEŠAVANJA-NE BRISATI'!$F$13=\"8>4\"),UPPER(IF(K36=\"\",\"\",VLOOKUP(K36,[1]sema!$BA$245:$BI$248,9))),IF(AND(O36=\"mq\",'[1]PODEŠAVANJA-NE BRISATI'!$F$13=\"16>4\"),UPPER(IF(K36=\"\",\"\",VLOOKUP(K36,[1]sema!$BA$254:$BI$265,9))),IF(AND(O36=\"mq\",'[1]PODEŠAVANJA-NE BRISATI'!$F$13=\"16>8\"),UPPER(IF(K36=\"\",\"\",VLOOKUP(K36,[1]sema!$BA$280:$BI$287,9))),IF(AND(O36=\"mq\",'[1]PODEŠAVANJA-NE BRISATI'!$F$13=\"32>4\"),UPPER(IF(K36=\"\",\"\",VLOOKUP(K36,[1]sema!$BA$298:$BI$325,9))),IF(AND(O36=\"mq\",'[1]PODEŠAVANJA-NE BRISATI'!$F$13=\"32>8\"),UPPER(IF(K36=\"\",\"\",VLOOKUP(K36,[1]sema!$BA$356:$BI$379,9))),IF(AND(O36=\"zq\",'[1]PODEŠAVANJA-NE BRISATI'!$F$14=\"8>4\"),UPPER(IF(K36=\"\",\"\",VLOOKUP(K36,[1]sema!$BA$249:$BI$252,9))),IF(AND(O36=\"zq\",'[1]PODEŠAVANJA-NE BRISATI'!$F$14=\"16>4\"),UPPER(IF(K36=\"\",\"\",VLOOKUP(K36,[1]sema!$BA$266:$BI$277,9))),IF(AND(O36=\"zq\",'[1]PODEŠAVANJA-NE BRISATI'!$F$14=\"16>8\"),UPPER(IF(K36=\"\",\"\",VLOOKUP(K36,[1]sema!$BA$288:$BI$295,9))),IF(AND(O36=\"zq\",'[1]PODEŠAVANJA-NE BRISATI'!$F$14=\"32>4\"),UPPER(IF(K36=\"\",\"\",VLOOKUP(K36,[1]sema!$BA$326:$BI$353,9))),IF(AND(O36=\"zq\",'[1]PODEŠAVANJA-NE BRISATI'!$F$14=\"32>8\"),UPPER(IF(K36=\"\",\"\",VLOOKUP(K36,[1]sema!$BA$380:$BI$403,9))),IF(AND(O36=\"md\",'[1]PODEŠAVANJA-NE BRISATI'!$E$13=4),UPPER(IF(K36=\"\",\"\",VLOOKUP(K36,[1]sema!$BA$406:$BK$408,11))),IF(AND(O36=\"zd\",'[1]PODEŠAVANJA-NE BRISATI'!$E$14=4),UPPER(IF(K36=\"\",\"\",VLOOKUP(K36,[1]sema!$BA$409:$BK$411,11))),IF(AND(O36=\"md\",'[1]PODEŠAVANJA-NE BRISATI'!$E$13=8),UPPER(IF(K36=\"\",\"\",VLOOKUP(K36,[1]sema!$BA$414:$BK$420,11))),IF(AND(O36=\"zd\",'[1]PODEŠAVANJA-NE BRISATI'!$E$14=8),UPPER(IF(K36=\"\",\"\",VLOOKUP(K36,[1]sema!$BA$421:$BK$427,11))),IF(AND(O36=\"md\",'[1]PODEŠAVANJA-NE BRISATI'!$E$13=16),UPPER(IF(K36=\"\",\"\",VLOOKUP(K36,[1]sema!$BA$430:$BK$444,11))),IF(AND(O36=\"zd\",'[1]PODEŠAVANJA-NE BRISATI'!$E$14=16),UPPER(IF(K36=\"\",\"\",VLOOKUP(K36,[1]sema!$BA$445:$BK$459,11))),\"\"))))))))))))))))))))))))","v":""}]
[]
[null,null,null,null,null,"NE PRE 15:30",null,null,null,null,"NE PRE 15:30"]
[null,null,null,null,"5. MEC",{"$f":"IF(ISBLANK(F44),\"\",IF(AND(J44=\"m\",'[1]PODEŠAVANJA-NE BRISATI'!$D$13=8),VLOOKUP(F44,[1]sema!$AX$7:$AY$13,2),IF(AND(J44=\"z\",'[1]PODEŠAVANJA-NE BRISATI'!$D$14=8),VLOOKUP(F44,[1]sema!$AX$14:$AY$20,2),IF(AND(J44=\"m\",'[1]PODEŠAVANJA-NE BRISATI'!$D$13=16),VLOOKUP(F44,[1]sema!$AX$22:$AY$36,2),IF(AND(J44=\"z\",'[1]PODEŠAVANJA-NE BRISATI'!$D$14=16),VLOOKUP(F44,[1]sema!$AX$37:$AY$51,2),IF(AND(J44=\"m\",'[1]PODEŠAVANJA-NE BRISATI'!$D$13=32),VLOOKUP(F44,[1]sema!$AX$53:$AY$83,2),IF(AND(J44=\"z\",'[1]PODEŠAVANJA-NE BRISATI'!$D$14=32),VLOOKUP(F44,[1]sema!$AX$84:$AY$114,2),IF(AND(J44=\"m\",'[1]PODEŠAVANJA-NE BRISATI'!$D$13=64),VLOOKUP(F44,[1]sema!$AX$116:$AY$178,2),IF(AND(J44=\"z\",'[1]PODEŠAVANJA-NE BRISATI'!$D$14=64),VLOOKUP(F44,[1]sema!$AX$179:$AY$241,2),IF(AND(J44=\"mq\",'[1]PODEŠAVANJA-NE BRISATI'!$F$13=\"8>4\"),VLOOKUP(F44,[1]sema!$AX$245:$AY$248,2),IF(AND(J44=\"zq\",'[1]PODEŠAVANJA-NE BRISATI'!$F$14=\"8>4\"),VLOOKUP(F44,[1]sema!$AX$249:$AY$252,2),IF(AND(J44=\"mq\",'[1]PODEŠAVANJA-NE BRISATI'!$F$13=\"16>4\"),VLOOKUP(F44,[1]sema!$AX$254:$AY$265,2),IF(AND(J44=\"zq\",'[1]PODEŠAVANJA-NE BRISATI'!$F$14=\"16>4\"),VLOOKUP(F44,[1]sema!$AX$266:$AY$277,2),IF(AND(J44=\"mq\",'[1]PODEŠAVANJA-NE BRISATI'!$F$13=\"16>8\"),VLOOKUP(F44,[1]sema!$AX$280:$AY$287,2),IF(AND(J44=\"zq\",'[1]PODEŠAVANJA-NE BRISATI'!$F$14=\"16>8\"),VLOOKUP(F44,[1]sema!$AX$288:$AY$295,2),IF(AND(J44=\"mq\",'[1]PODEŠAVANJA-NE BRISATI'!$F$13=\"32>4\"),VLOOKUP(F44,[1]sema!$AX$298:$AY$325,2),IF(AND(J44=\"zq\",'[1]PODEŠAVANJA-NE BRISATI'!$F$14=\"32>4\"),VLOOKUP(F44,[1]sema!$AX$326:$AY$353,2),IF(AND(J44=\"mq\",'[1]PODEŠAVANJA-NE BRISATI'!$F$13=\"32>8\"),VLOOKUP(F44,[1]sema!$AX$356:$AY$379,2),IF(AND(J44=\"zq\",'[1]PODEŠAVANJA-NE BRISATI'!$F$14=\"32>8\"),VLOOKUP(F44,[1]sema!$AX$380:$AY$403,2),IF(AND(J44=\"md\",'[1]PODEŠAVANJA-NE BRISATI'!$E$13=4),VLOOKUP(F44,[1]sema!$AX$406:$AY$408,2),IF(AND(J44=\"zd\",'[1]PODEŠAVANJA-NE BRISATI'!$E$14=4),VLOOKUP(F44,[1]sema!$AX$409:$AY$411,2),IF(AND(J44=\"md\",'[1]PODEŠAVANJA-NE BRISATI'!$E$13=8),VLOOKUP(F44,[1]sema!$AX$414:$AY$420,2),IF(AND(J44=\"zd\",'[1]PODEŠAVANJA-NE BRISATI'!$E$14=8),VLOOKUP(F44,[1]sema!$AX$421:$AY$427,2),IF(AND(J44=\"md\",'[1]PODEŠAVANJA-NE BRISATI'!$E$13=16),VLOOKUP(F44,[1]sema!$AX$430:$AY$444,2),IF(AND(J44=\"zd\",'[1]PODEŠAVANJA-NE BRISATI'!$E$14=8),VLOOKUP(F44,[1]sema!$AX$445:$AY$459,2))))))))))))))))))))))))))","v":""},null,null,null,null,{"$f":"IF(ISBLANK(K44),\"\",IF(AND(O44=\"m\",'[1]PODEŠAVANJA-NE BRISATI'!$D$13=8),VLOOKUP(K44,[1]sema!$AX$7:$AY$13,2),IF(AND(O44=\"z\",'[1]PODEŠAVANJA-NE BRISATI'!$D$14=8),VLOOKUP(K44,[1]sema!$AX$14:$AY$20,2),IF(AND(O44=\"m\",'[1]PODEŠAVANJA-NE BRISATI'!$D$13=16),VLOOKUP(K44,[1]sema!$AX$22:$AY$36,2),IF(AND(O44=\"z\",'[1]PODEŠAVANJA-NE BRISATI'!$D$14=16),VLOOKUP(K44,[1]sema!$AX$37:$AY$51,2),IF(AND(O44=\"m\",'[1]PODEŠAVANJA-NE BRISATI'!$D$13=32),VLOOKUP(K44,[1]sema!$AX$53:$AY$83,2),IF(AND(O44=\"z\",'[1]PODEŠAVANJA-NE BRISATI'!$D$14=32),VLOOKUP(K44,[1]sema!$AX$84:$AY$114,2),IF(AND(O44=\"m\",'[1]PODEŠAVANJA-NE BRISATI'!$D$13=64),VLOOKUP(K44,[1]sema!$AX$116:$AY$178,2),IF(AND(O44=\"z\",'[1]PODEŠAVANJA-NE BRISATI'!$D$14=64),VLOOKUP(K44,[1]sema!$AX$179:$AY$241,2),IF(AND(O44=\"mq\",'[1]PODEŠAVANJA-NE BRISATI'!$F$13=\"8>4\"),VLOOKUP(K44,[1]sema!$AX$245:$AY$248,2),IF(AND(O44=\"zq\",'[1]PODEŠAVANJA-NE BRISATI'!$F$14=\"8>4\"),VLOOKUP(K44,[1]sema!$AX$249:$AY$252,2),IF(AND(O44=\"mq\",'[1]PODEŠAVANJA-NE BRISATI'!$F$13=\"16>4\"),VLOOKUP(K44,[1]sema!$AX$254:$AY$265,2),IF(AND(O44=\"zq\",'[1]PODEŠAVANJA-NE BRISATI'!$F$14=\"16>4\"),VLOOKUP(K44,[1]sema!$AX$266:$AY$277,2),IF(AND(O44=\"mq\",'[1]PODEŠAVANJA-NE BRISATI'!$F$13=\"16>8\"),VLOOKUP(K44,[1]sema!$AX$280:$AY$287,2),IF(AND(O44=\"zq\",'[1]PODEŠAVANJA-NE BRISATI'!$F$14=\"16>8\"),VLOOKUP(K44,[1]sema!$AX$288:$AY$295,2),IF(AND(O44=\"mq\",'[1]PODEŠAVANJA-NE BRISATI'!$F$13=\"32>4\"),VLOOKUP(K44,[1]sema!$AX$298:$AY$325,2),IF(AND(O44=\"zq\",'[1]PODEŠAVANJA-NE BRISATI'!$F$14=\"32>4\"),VLOOKUP(K44,[1]sema!$AX$326:$AY$353,2),IF(AND(O44=\"mq\",'[1]PODEŠAVANJA-NE BRISATI'!$F$13=\"32>8\"),VLOOKUP(K44,[1]sema!$AX$356:$AY$379,2),IF(AND(O44=\"zq\",'[1]PODEŠAVANJA-NE BRISATI'!$F$14=\"32>8\"),VLOOKUP(K44,[1]sema!$AX$380:$AY$403,2),IF(AND(O44=\"md\",'[1]PODEŠAVANJA-NE BRISATI'!$E$13=4),VLOOKUP(K44,[1]sema!$AX$406:$AY$408,2),IF(AND(O44=\"zd\",'[1]PODEŠAVANJA-NE BRISATI'!$E$14=4),VLOOKUP(K44,[1]sema!$AX$409:$AY$411,2),IF(AND(O44=\"md\",'[1]PODEŠAVANJA-NE BRISATI'!$E$13=8),VLOOKUP(K44,[1]sema!$AX$414:$AY$420,2),IF(AND(O44=\"zd\",'[1]PODEŠAVANJA-NE BRISATI'!$E$14=8),VLOOKUP(K44,[1]sema!$AX$421:$AY$427,2),IF(AND(O44=\"md\",'[1]PODEŠAVANJA-NE BRISATI'!$E$13=16),VLOOKUP(K44,[1]sema!$AX$430:$AY$444,2),IF(AND(O44=\"zd\",'[1]PODEŠAVANJA-NE BRISATI'!$E$14=8),VLOOKUP(K44,[1]sema!$AX$445:$AY$459,2))))))))))))))))))))))))))","v":""}]
[null,null,null,null,null,{"$f":"IF(AND(J44=\"m\",'[1]PODEŠAVANJA-NE BRISATI'!$D$13=8),UPPER(IF(F44=\"\",\"\",VLOOKUP(F44,[1]sema!$BA$7:$BI$13,8))),IF(AND(J44=\"z\",'[1]PODEŠAVANJA-NE BRISATI'!$D$14=8),UPPER(IF(F44=\"\",\"\",VLOOKUP(F44,[1]sema!$BA$14:$BI$20,8))),IF(AND(J44=\"m\",'[1]PODEŠAVANJA-NE BRISATI'!$D$13=16),UPPER(IF(F44=\"\",\"\",VLOOKUP(F44,[1]sema!$BA$22:$BI$36,8))),IF(AND(J44=\"z\",'[1]PODEŠAVANJA-NE BRISATI'!$D$14=16),UPPER(IF(F44=\"\",\"\",VLOOKUP(F44,[1]sema!$BA$37:$BI$51,8))),IF(AND(J44=\"m\",'[1]PODEŠAVANJA-NE BRISATI'!$D$13=32),UPPER(IF(F44=\"\",\"\",VLOOKUP(F44,[1]sema!$BA$53:$BI$83,8))),IF(AND(J44=\"z\",'[1]PODEŠAVANJA-NE BRISATI'!$D$14=32),UPPER(IF(F44=\"\",\"\",VLOOKUP(F44,[1]sema!$BA$84:$BI$114,8))),IF(AND(J44=\"m\",'[1]PODEŠAVANJA-NE BRISATI'!$D$13=64),UPPER(IF(F44=\"\",\"\",VLOOKUP(F44,[1]sema!$BA$116:$BI$178,8))),IF(AND(J44=\"z\",'[1]PODEŠAVANJA-NE BRISATI'!$D$14=64),UPPER(IF(F44=\"\",\"\",VLOOKUP(F44,[1]sema!$BA$179:$BI$241,8))),IF(AND(J44=\"mq\",'[1]PODEŠAVANJA-NE BRISATI'!$F$13=\"8>4\"),UPPER(IF(F44=\"\",\"\",VLOOKUP(F44,[1]sema!$BA$245:$BI$248,8))),IF(AND(J44=\"mq\",'[1]PODEŠAVANJA-NE BRISATI'!$F$13=\"16>4\"),UPPER(IF(F44=\"\",\"\",VLOOKUP(F44,[1]sema!$BA$254:$BI$265,8))),IF(AND(J44=\"mq\",'[1]PODEŠAVANJA-NE BRISATI'!$F$13=\"16>8\"),UPPER(IF(F44=\"\",\"\",VLOOKUP(F44,[1]sema!$BA$280:$BI$287,8))),IF(AND(J44=\"mq\",'[1]PODEŠAVANJA-NE BRISATI'!$F$13=\"32>4\"),UPPER(IF(F44=\"\",\"\",VLOOKUP(F44,[1]sema!$BA$298:$BI$325,8))),IF(AND(J44=\"mq\",'[1]PODEŠAVANJA-NE BRISATI'!$F$13=\"32>8\"),UPPER(IF(F44=\"\",\"\",VLOOKUP(F44,[1]sema!$BA$356:$BI$379,8))),IF(AND(J44=\"zq\",'[1]PODEŠAVANJA-NE BRISATI'!$F$14=\"8>4\"),UPPER(IF(F44=\"\",\"\",VLOOKUP(F44,[1]sema!$BA$249:$BI$252,8))),IF(AND(J44=\"zq\",'[1]PODEŠAVANJA-NE BRISATI'!$F$14=\"16>4\"),UPPER(IF(F44=\"\",\"\",VLOOKUP(F44,[1]sema!$BA$266:$BI$277,8))),IF(AND(J44=\"zq\",'[1]PODEŠAVANJA-NE BRISATI'!$F$14=\"16>8\"),UPPER(IF(F44=\"\",\"\",VLOOKUP(F44,[1]sema!$BA$288:$BI$295,8))),IF(AND(J44=\"zq\",'[1]PODEŠAVANJA-NE BRISATI'!$F$14=\"32>4\"),UPPER(IF(F44=\"\",\"\",VLOOKUP(F44,[1]sema!$BA$326:$BI$353,8))),IF(AND(J44=\"zq\",'[1]PODEŠAVANJA-NE BRISATI'!$F$14=\"32>8\"),UPPER(IF(F44=\"\",\"\",VLOOKUP(F44,[1]sema!$BA$380:$BI$403,8))),IF(AND(J44=\"md\",'[1]PODEŠAVANJA-NE BRISATI'!$E$13=4),UPPER(IF(F44=\"\",\"\",VLOOKUP(F44,[1]sema!$BA$406:$BK$408,8))),IF(AND(J44=\"zd\",'[1]PODEŠAVANJA-NE BRISATI'!$E$14=4),UPPER(IF(F44=\"\",\"\",VLOOKUP(F44,[1]sema!$BA$409:$BK$411,8))),IF(AND(J44=\"md\",'[1]PODEŠAVANJA-NE BRISATI'!$E$13=8),UPPER(IF(F44=\"\",\"\",VLOOKUP(F44,[1]sema!$BA$414:$BK$420,8))),IF(AND(J44=\"zd\",'[1]PODEŠAVANJA-NE BRISATI'!$E$14=8),UPPER(IF(F44=\"\",\"\",VLOOKUP(F44,[1]sema!$BA$421:$BK$427,8))),IF(AND(J44=\"md\",'[1]PODEŠAVANJA-NE BRISATI'!$E$13=16),UPPER(IF(F44=\"\",\"\",VLOOKUP(F44,[1]sema!$BA$430:$BK$444,8))),IF(AND(J44=\"zd\",'[1]PODEŠAVANJA-NE BRISATI'!$E$14=16),UPPER(IF(F44=\"\",\"\",VLOOKUP(F44,[1]sema!$BA$445:$BK$459,8))),\"\"))))))))))))))))))))))))","v":""},null,null,null,null,{"$f":"IF(AND(O44=\"m\",'[1]PODEŠAVANJA-NE BRISATI'!$D$13=8),UPPER(IF(K44=\"\",\"\",VLOOKUP(K44,[1]sema!$BA$7:$BI$13,8))),IF(AND(O44=\"z\",'[1]PODEŠAVANJA-NE BRISATI'!$D$14=8),UPPER(IF(K44=\"\",\"\",VLOOKUP(K44,[1]sema!$BA$14:$BI$20,8))),IF(AND(O44=\"m\",'[1]PODEŠAVANJA-NE BRISATI'!$D$13=16),UPPER(IF(K44=\"\",\"\",VLOOKUP(K44,[1]sema!$BA$22:$BI$36,8))),IF(AND(O44=\"z\",'[1]PODEŠAVANJA-NE BRISATI'!$D$14=16),UPPER(IF(K44=\"\",\"\",VLOOKUP(K44,[1]sema!$BA$37:$BI$51,8))),IF(AND(O44=\"m\",'[1]PODEŠAVANJA-NE BRISATI'!$D$13=32),UPPER(IF(K44=\"\",\"\",VLOOKUP(K44,[1]sema!$BA$53:$BI$83,8))),IF(AND(O44=\"z\",'[1]PODEŠAVANJA-NE BRISATI'!$D$14=32),UPPER(IF(K44=\"\",\"\",VLOOKUP(K44,[1]sema!$BA$84:$BI$114,8))),IF(AND(O44=\"m\",'[1]PODEŠAVANJA-NE BRISATI'!$D$13=64),UPPER(IF(K44=\"\",\"\",VLOOKUP(K44,[1]sema!$BA$116:$BI$178,8))),IF(AND(O44=\"z\",'[1]PODEŠAVANJA-NE BRISATI'!$D$14=64),UPPER(IF(K44=\"\",\"\",VLOOKUP(K44,[1]sema!$BA$179:$BI$241,8))),IF(AND(O44=\"mq\",'[1]PODEŠAVANJA-NE BRISATI'!$F$13=\"8>4\"),UPPER(IF(K44=\"\",\"\",VLOOKUP(K44,[1]sema!$BA$245:$BI$248,8))),IF(AND(O44=\"mq\",'[1]PODEŠAVANJA-NE BRISATI'!$F$13=\"16>4\"),UPPER(IF(K44=\"\",\"\",VLOOKUP(K44,[1]sema!$BA$254:$BI$265,8))),IF(AND(O44=\"mq\",'[1]PODEŠAVANJA-NE BRISATI'!$F$13=\"16>8\"),UPPER(IF(K44=\"\",\"\",VLOOKUP(K44,[1]sema!$BA$280:$BI$287,8))),IF(AND(O44=\"mq\",'[1]PODEŠAVANJA-NE BRISATI'!$F$13=\"32>4\"),UPPER(IF(K44=\"\",\"\",VLOOKUP(K44,[1]sema!$BA$298:$BI$325,8))),IF(AND(O44=\"mq\",'[1]PODEŠAVANJA-NE BRISATI'!$F$13=\"32>8\"),UPPER(IF(K44=\"\",\"\",VLOOKUP(K44,[1]sema!$BA$356:$BI$379,8))),IF(AND(O44=\"zq\",'[1]PODEŠAVANJA-NE BRISATI'!$F$14=\"8>4\"),UPPER(IF(K44=\"\",\"\",VLOOKUP(K44,[1]sema!$BA$249:$BI$252,8))),IF(AND(O44=\"zq\",'[1]PODEŠAVANJA-NE BRISATI'!$F$14=\"16>4\"),UPPER(IF(K44=\"\",\"\",VLOOKUP(K44,[1]sema!$BA$266:$BI$277,8))),IF(AND(O44=\"zq\",'[1]PODEŠAVANJA-NE BRISATI'!$F$14=\"16>8\"),UPPER(IF(K44=\"\",\"\",VLOOKUP(K44,[1]sema!$BA$288:$BI$295,8))),IF(AND(O44=\"zq\",'[1]PODEŠAVANJA-NE BRISATI'!$F$14=\"32>4\"),UPPER(IF(K44=\"\",\"\",VLOOKUP(K44,[1]sema!$BA$326:$BI$353,8))),IF(AND(O44=\"zq\",'[1]PODEŠAVANJA-NE BRISATI'!$F$14=\"32>8\"),UPPER(IF(K44=\"\",\"\",VLOOKUP(K44,[1]sema!$BA$380:$BI$403,8))),IF(AND(O44=\"md\",'[1]PODEŠAVANJA-NE BRISATI'!$E$13=4),UPPER(IF(K44=\"\",\"\",VLOOKUP(K44,[1]sema!$BA$406:$BK$408,8))),IF(AND(O44=\"zd\",'[1]PODEŠAVANJA-NE BRISATI'!$E$14=4),UPPER(IF(K44=\"\",\"\",VLOOKUP(K44,[1]sema!$BA$409:$BK$411,8))),IF(AND(O44=\"md\",'[1]PODEŠAVANJA-NE BRISATI'!$E$13=8),UPPER(IF(K44=\"\",\"\",VLOOKUP(K44,[1]sema!$BA$414:$BK$420,8))),IF(AND(O44=\"zd\",'[1]PODEŠAVANJA-NE BRISATI'!$E$14=8),UPPER(IF(K44=\"\",\"\",VLOOKUP(K44,[1]sema!$BA$421:$BK$427,8))),IF(AND(O44=\"md\",'[1]PODEŠAVANJA-NE BRISATI'!$E$13=16),UPPER(IF(K44=\"\",\"\",VLOOKUP(K44,[1]sema!$BA$430:$BK$444,8))),IF(AND(O44=\"zd\",'[1]PODEŠAVANJA-NE BRISATI'!$E$14=16),UPPER(IF(K44=\"\",\"\",VLOOKUP(K44,[1]sema!$BA$445:$BK$459,8))),\"\"))))))))))))))))))))))))","v":""}]
[]
[null,null,null,null,null,null,"vs.",null,null,{"$f":"MID(F44,3,2)","v":""},null,"vs.",null,null,{"$f":"MID(K44,3,2)","v":""}]
[]
[null,null,null,null,null,{"$f":"IF(AND(J44=\"m\",'[1]PODEŠAVANJA-NE BRISATI'!$D$13=8),UPPER(IF(F44=\"\",\"\",VLOOKUP(F44,[1]sema!$BA$7:$BI$13,9))),IF(AND(J44=\"z\",'[1]PODEŠAVANJA-NE BRISATI'!$D$14=8),UPPER(IF(F44=\"\",\"\",VLOOKUP(F44,[1]sema!$BA$14:$BI$20,9))),IF(AND(J44=\"m\",'[1]PODEŠAVANJA-NE BRISATI'!$D$13=16),UPPER(IF(F44=\"\",\"\",VLOOKUP(F44,[1]sema!$BA$22:$BI$36,9))),IF(AND(J44=\"z\",'[1]PODEŠAVANJA-NE BRISATI'!$D$14=16),UPPER(IF(F44=\"\",\"\",VLOOKUP(F44,[1]sema!$BA$37:$BI$51,9))),IF(AND(J44=\"m\",'[1]PODEŠAVANJA-NE BRISATI'!$D$13=32),UPPER(IF(F44=\"\",\"\",VLOOKUP(F44,[1]sema!$BA$53:$BI$83,9))),IF(AND(J44=\"z\",'[1]PODEŠAVANJA-NE BRISATI'!$D$14=32),UPPER(IF(F44=\"\",\"\",VLOOKUP(F44,[1]sema!$BA$84:$BI$114,9))),IF(AND(J44=\"m\",'[1]PODEŠAVANJA-NE BRISATI'!$D$13=64),UPPER(IF(F44=\"\",\"\",VLOOKUP(F44,[1]sema!$BA$116:$BI$178,9))),IF(AND(J44=\"z\",'[1]PODEŠAVANJA-NE BRISATI'!$D$14=64),UPPER(IF(F44=\"\",\"\",VLOOKUP(F44,[1]sema!$BA$179:$BI$241,9))),IF(AND(J44=\"mq\",'[1]PODEŠAVANJA-NE BRISATI'!$F$13=\"8>4\"),UPPER(IF(F44=\"\",\"\",VLOOKUP(F44,[1]sema!$BA$245:$BI$248,9))),IF(AND(J44=\"mq\",'[1]PODEŠAVANJA-NE BRISATI'!$F$13=\"16>4\"),UPPER(IF(F44=\"\",\"\",VLOOKUP(F44,[1]sema!$BA$254:$BI$265,9))),IF(AND(J44=\"mq\",'[1]PODEŠAVANJA-NE BRISATI'!$F$13=\"16>8\"),UPPER(IF(F44=\"\",\"\",VLOOKUP(F44,[1]sema!$BA$280:$BI$287,9))),IF(AND(J44=\"mq\",'[1]PODEŠAVANJA-NE BRISATI'!$F$13=\"32>4\"),UPPER(IF(F44=\"\",\"\",VLOOKUP(F44,[1]sema!$BA$298:$BI$325,9))),IF(AND(J44=\"mq\",'[1]PODEŠAVANJA-NE BRISATI'!$F$13=\"32>8\"),UPPER(IF(F44=\"\",\"\",VLOOKUP(F44,[1]sema!$BA$356:$BI$379,9))),IF(AND(J44=\"zq\",'[1]PODEŠAVANJA-NE BRISATI'!$F$14=\"8>4\"),UPPER(IF(F44=\"\",\"\",VLOOKUP(F44,[1]sema!$BA$249:$BI$252,9))),IF(AND(J44=\"zq\",'[1]PODEŠAVANJA-NE BRISATI'!$F$14=\"16>4\"),UPPER(IF(F44=\"\",\"\",VLOOKUP(F44,[1]sema!$BA$266:$BI$277,9))),IF(AND(J44=\"zq\",'[1]PODEŠAVANJA-NE BRISATI'!$F$14=\"16>8\"),UPPER(IF(F44=\"\",\"\",VLOOKUP(F44,[1]sema!$BA$288:$BI$295,9))),IF(AND(J44=\"zq\",'[1]PODEŠAVANJA-NE BRISATI'!$F$14=\"32>4\"),UPPER(IF(F44=\"\",\"\",VLOOKUP(F44,[1]sema!$BA$326:$BI$353,9))),IF(AND(J44=\"zq\",'[1]PODEŠAVANJA-NE BRISATI'!$F$14=\"32>8\"),UPPER(IF(F44=\"\",\"\",VLOOKUP(F44,[1]sema!$BA$380:$BI$403,9))),IF(AND(J44=\"md\",'[1]PODEŠAVANJA-NE BRISATI'!$E$13=4),UPPER(IF(F44=\"\",\"\",VLOOKUP(F44,[1]sema!$BA$406:$BK$408,11))),IF(AND(J44=\"zd\",'[1]PODEŠAVANJA-NE BRISATI'!$E$14=4),UPPER(IF(F44=\"\",\"\",VLOOKUP(F44,[1]sema!$BA$409:$BK$411,11))),IF(AND(J44=\"md\",'[1]PODEŠAVANJA-NE BRISATI'!$E$13=8),UPPER(IF(F44=\"\",\"\",VLOOKUP(F44,[1]sema!$BA$414:$BK$420,11))),IF(AND(J44=\"zd\",'[1]PODEŠAVANJA-NE BRISATI'!$E$14=8),UPPER(IF(F44=\"\",\"\",VLOOKUP(F44,[1]sema!$BA$421:$BK$427,11))),IF(AND(J44=\"md\",'[1]PODEŠAVANJA-NE BRISATI'!$E$13=16),UPPER(IF(F44=\"\",\"\",VLOOKUP(F44,[1]sema!$BA$430:$BK$444,11))),IF(AND(J44=\"zd\",'[1]PODEŠAVANJA-NE BRISATI'!$E$14=16),UPPER(IF(F44=\"\",\"\",VLOOKUP(F44,[1]sema!$BA$445:$BK$459,11))),\"\"))))))))))))))))))))))))","v":""},null,null,null,null,{"$f":"IF(AND(O44=\"m\",'[1]PODEŠAVANJA-NE BRISATI'!$D$13=8),UPPER(IF(K44=\"\",\"\",VLOOKUP(K44,[1]sema!$BA$7:$BI$13,9))),IF(AND(O44=\"z\",'[1]PODEŠAVANJA-NE BRISATI'!$D$14=8),UPPER(IF(K44=\"\",\"\",VLOOKUP(K44,[1]sema!$BA$14:$BI$20,9))),IF(AND(O44=\"m\",'[1]PODEŠAVANJA-NE BRISATI'!$D$13=16),UPPER(IF(K44=\"\",\"\",VLOOKUP(K44,[1]sema!$BA$22:$BI$36,9))),IF(AND(O44=\"z\",'[1]PODEŠAVANJA-NE BRISATI'!$D$14=16),UPPER(IF(K44=\"\",\"\",VLOOKUP(K44,[1]sema!$BA$37:$BI$51,9))),IF(AND(O44=\"m\",'[1]PODEŠAVANJA-NE BRISATI'!$D$13=32),UPPER(IF(K44=\"\",\"\",VLOOKUP(K44,[1]sema!$BA$53:$BI$83,9))),IF(AND(O44=\"z\",'[1]PODEŠAVANJA-NE BRISATI'!$D$14=32),UPPER(IF(K44=\"\",\"\",VLOOKUP(K44,[1]sema!$BA$84:$BI$114,9))),IF(AND(O44=\"m\",'[1]PODEŠAVANJA-NE BRISATI'!$D$13=64),UPPER(IF(K44=\"\",\"\",VLOOKUP(K44,[1]sema!$BA$116:$BI$178,9))),IF(AND(O44=\"z\",'[1]PODEŠAVANJA-NE BRISATI'!$D$14=64),UPPER(IF(K44=\"\",\"\",VLOOKUP(K44,[1]sema!$BA$179:$BI$241,9))),IF(AND(O44=\"mq\",'[1]PODEŠAVANJA-NE BRISATI'!$F$13=\"8>4\"),UPPER(IF(K44=\"\",\"\",VLOOKUP(K44,[1]sema!$BA$245:$BI$248,9))),IF(AND(O44=\"mq\",'[1]PODEŠAVANJA-NE BRISATI'!$F$13=\"16>4\"),UPPER(IF(K44=\"\",\"\",VLOOKUP(K44,[1]sema!$BA$254:$BI$265,9))),IF(AND(O44=\"mq\",'[1]PODEŠAVANJA-NE BRISATI'!$F$13=\"16>8\"),UPPER(IF(K44=\"\",\"\",VLOOKUP(K44,[1]sema!$BA$280:$BI$287,9))),IF(AND(O44=\"mq\",'[1]PODEŠAVANJA-NE BRISATI'!$F$13=\"32>4\"),UPPER(IF(K44=\"\",\"\",VLOOKUP(K44,[1]sema!$BA$298:$BI$325,9))),IF(AND(O44=\"mq\",'[1]PODEŠAVANJA-NE BRISATI'!$F$13=\"32>8\"),UPPER(IF(K44=\"\",\"\",VLOOKUP(K44,[1]sema!$BA$356:$BI$379,9))),IF(AND(O44=\"zq\",'[1]PODEŠAVANJA-NE BRISATI'!$F$14=\"8>4\"),UPPER(IF(K44=\"\",\"\",VLOOKUP(K44,[1]sema!$BA$249:$BI$252,9))),IF(AND(O44=\"zq\",'[1]PODEŠAVANJA-NE BRISATI'!$F$14=\"16>4\"),UPPER(IF(K44=\"\",\"\",VLOOKUP(K44,[1]sema!$BA$266:$BI$277,9))),IF(AND(O44=\"zq\",'[1]PODEŠAVANJA-NE BRISATI'!$F$14=\"16>8\"),UPPER(IF(K44=\"\",\"\",VLOOKUP(K44,[1]sema!$BA$288:$BI$295,9))),IF(AND(O44=\"zq\",'[1]PODEŠAVANJA-NE BRISATI'!$F$14=\"32>4\"),UPPER(IF(K44=\"\",\"\",VLOOKUP(K44,[1]sema!$BA$326:$BI$353,9))),IF(AND(O44=\"zq\",'[1]PODEŠAVANJA-NE BRISATI'!$F$14=\"32>8\"),UPPER(IF(K44=\"\",\"\",VLOOKUP(K44,[1]sema!$BA$380:$BI$403,9))),IF(AND(O44=\"md\",'[1]PODEŠAVANJA-NE BRISATI'!$E$13=4),UPPER(IF(K44=\"\",\"\",VLOOKUP(K44,[1]sema!$BA$406:$BK$408,11))),IF(AND(O44=\"zd\",'[1]PODEŠAVANJA-NE BRISATI'!$E$14=4),UPPER(IF(K44=\"\",\"\",VLOOKUP(K44,[1]sema!$BA$409:$BK$411,11))),IF(AND(O44=\"md\",'[1]PODEŠAVANJA-NE BRISATI'!$E$13=8),UPPER(IF(K44=\"\",\"\",VLOOKUP(K44,[1]sema!$BA$414:$BK$420,11))),IF(AND(O44=\"zd\",'[1]PODEŠAVANJA-NE BRISATI'!$E$14=8),UPPER(IF(K44=\"\",\"\",VLOOKUP(K44,[1]sema!$BA$421:$BK$427,11))),IF(AND(O44=\"md\",'[1]PODEŠAVANJA-NE BRISATI'!$E$13=16),UPPER(IF(K44=\"\",\"\",VLOOKUP(K44,[1]sema!$BA$430:$BK$444,11))),IF(AND(O44=\"zd\",'[1]PODEŠAVANJA-NE BRISATI'!$E$14=16),UPPER(IF(K44=\"\",\"\",VLOOKUP(K44,[1]sema!$BA$445:$BK$459,11))),\"\"))))))))))))))))))))))))","v":""}]
[]
[null,null,null,null,null,"NE PRE 17H",null,null,null,null,"NE PRE 17H"]
[null,null,null,null,"6. MEC",{"$f":"IF(ISBLANK(F52),\"\",IF(AND(J52=\"m\",'[1]PODEŠAVANJA-NE BRISATI'!$D$13=8),VLOOKUP(F52,[1]sema!$AX$7:$AY$13,2),IF(AND(J52=\"z\",'[1]PODEŠAVANJA-NE BRISATI'!$D$14=8),VLOOKUP(F52,[1]sema!$AX$14:$AY$20,2),IF(AND(J52=\"m\",'[1]PODEŠAVANJA-NE BRISATI'!$D$13=16),VLOOKUP(F52,[1]sema!$AX$22:$AY$36,2),IF(AND(J52=\"z\",'[1]PODEŠAVANJA-NE BRISATI'!$D$14=16),VLOOKUP(F52,[1]sema!$AX$37:$AY$51,2),IF(AND(J52=\"m\",'[1]PODEŠAVANJA-NE BRISATI'!$D$13=32),VLOOKUP(F52,[1]sema!$AX$53:$AY$83,2),IF(AND(J52=\"z\",'[1]PODEŠAVANJA-NE BRISATI'!$D$14=32),VLOOKUP(F52,[1]sema!$AX$84:$AY$114,2),IF(AND(J52=\"m\",'[1]PODEŠAVANJA-NE BRISATI'!$D$13=64),VLOOKUP(F52,[1]sema!$AX$116:$AY$178,2),IF(AND(J52=\"z\",'[1]PODEŠAVANJA-NE BRISATI'!$D$14=64),VLOOKUP(F52,[1]sema!$AX$179:$AY$241,2),IF(AND(J52=\"mq\",'[1]PODEŠAVANJA-NE BRISATI'!$F$13=\"8>4\"),VLOOKUP(F52,[1]sema!$AX$245:$AY$248,2),IF(AND(J52=\"zq\",'[1]PODEŠAVANJA-NE BRISATI'!$F$14=\"8>4\"),VLOOKUP(F52,[1]sema!$AX$249:$AY$252,2),IF(AND(J52=\"mq\",'[1]PODEŠAVANJA-NE BRISATI'!$F$13=\"16>4\"),VLOOKUP(F52,[1]sema!$AX$254:$AY$265,2),IF(AND(J52=\"zq\",'[1]PODEŠAVANJA-NE BRISATI'!$F$14=\"16>4\"),VLOOKUP(F52,[1]sema!$AX$266:$AY$277,2),IF(AND(J52=\"mq\",'[1]PODEŠAVANJA-NE BRISATI'!$F$13=\"16>8\"),VLOOKUP(F52,[1]sema!$AX$280:$AY$287,2),IF(AND(J52=\"zq\",'[1]PODEŠAVANJA-NE BRISATI'!$F$14=\"16>8\"),VLOOKUP(F52,[1]sema!$AX$288:$AY$295,2),IF(AND(J52=\"mq\",'[1]PODEŠAVANJA-NE BRISATI'!$F$13=\"32>4\"),VLOOKUP(F52,[1]sema!$AX$298:$AY$325,2),IF(AND(J52=\"zq\",'[1]PODEŠAVANJA-NE BRISATI'!$F$14=\"32>4\"),VLOOKUP(F52,[1]sema!$AX$326:$AY$353,2),IF(AND(J52=\"mq\",'[1]PODEŠAVANJA-NE BRISATI'!$F$13=\"32>8\"),VLOOKUP(F52,[1]sema!$AX$356:$AY$379,2),IF(AND(J52=\"zq\",'[1]PODEŠAVANJA-NE BRISATI'!$F$14=\"32>8\"),VLOOKUP(F52,[1]sema!$AX$380:$AY$403,2),IF(AND(J52=\"md\",'[1]PODEŠAVANJA-NE BRISATI'!$E$13=4),VLOOKUP(F52,[1]sema!$AX$406:$AY$408,2),IF(AND(J52=\"zd\",'[1]PODEŠAVANJA-NE BRISATI'!$E$14=4),VLOOKUP(F52,[1]sema!$AX$409:$AY$411,2),IF(AND(J52=\"md\",'[1]PODEŠAVANJA-NE BRISATI'!$E$13=8),VLOOKUP(F52,[1]sema!$AX$414:$AY$420,2),IF(AND(J52=\"zd\",'[1]PODEŠAVANJA-NE BRISATI'!$E$14=8),VLOOKUP(F52,[1]sema!$AX$421:$AY$427,2),IF(AND(J52=\"md\",'[1]PODEŠAVANJA-NE BRISATI'!$E$13=16),VLOOKUP(F52,[1]sema!$AX$430:$AY$444,2),IF(AND(J52=\"zd\",'[1]PODEŠAVANJA-NE BRISATI'!$E$14=8),VLOOKUP(F52,[1]sema!$AX$445:$AY$459,2))))))))))))))))))))))))))","v":""},null,null,null,null,{"$f":"IF(ISBLANK(K52),\"\",IF(AND(O52=\"m\",'[1]PODEŠAVANJA-NE BRISATI'!$D$13=8),VLOOKUP(K52,[1]sema!$AX$7:$AY$13,2),IF(AND(O52=\"z\",'[1]PODEŠAVANJA-NE BRISATI'!$D$14=8),VLOOKUP(K52,[1]sema!$AX$14:$AY$20,2),IF(AND(O52=\"m\",'[1]PODEŠAVANJA-NE BRISATI'!$D$13=16),VLOOKUP(K52,[1]sema!$AX$22:$AY$36,2),IF(AND(O52=\"z\",'[1]PODEŠAVANJA-NE BRISATI'!$D$14=16),VLOOKUP(K52,[1]sema!$AX$37:$AY$51,2),IF(AND(O52=\"m\",'[1]PODEŠAVANJA-NE BRISATI'!$D$13=32),VLOOKUP(K52,[1]sema!$AX$53:$AY$83,2),IF(AND(O52=\"z\",'[1]PODEŠAVANJA-NE BRISATI'!$D$14=32),VLOOKUP(K52,[1]sema!$AX$84:$AY$114,2),IF(AND(O52=\"m\",'[1]PODEŠAVANJA-NE BRISATI'!$D$13=64),VLOOKUP(K52,[1]sema!$AX$116:$AY$178,2),IF(AND(O52=\"z\",'[1]PODEŠAVANJA-NE BRISATI'!$D$14=64),VLOOKUP(K52,[1]sema!$AX$179:$AY$241,2),IF(AND(O52=\"mq\",'[1]PODEŠAVANJA-NE BRISATI'!$F$13=\"8>4\"),VLOOKUP(K52,[1]sema!$AX$245:$AY$248,2),IF(AND(O52=\"zq\",'[1]PODEŠAVANJA-NE BRISATI'!$F$14=\"8>4\"),VLOOKUP(K52,[1]sema!$AX$249:$AY$252,2),IF(AND(O52=\"mq\",'[1]PODEŠAVANJA-NE BRISATI'!$F$13=\"16>4\"),VLOOKUP(K52,[1]sema!$AX$254:$AY$265,2),IF(AND(O52=\"zq\",'[1]PODEŠAVANJA-NE BRISATI'!$F$14=\"16>4\"),VLOOKUP(K52,[1]sema!$AX$266:$AY$277,2),IF(AND(O52=\"mq\",'[1]PODEŠAVANJA-NE BRISATI'!$F$13=\"16>8\"),VLOOKUP(K52,[1]sema!$AX$280:$AY$287,2),IF(AND(O52=\"zq\",'[1]PODEŠAVANJA-NE BRISATI'!$F$14=\"16>8\"),VLOOKUP(K52,[1]sema!$AX$288:$AY$295,2),IF(AND(O52=\"mq\",'[1]PODEŠAVANJA-NE BRISATI'!$F$13=\"32>4\"),VLOOKUP(K52,[1]sema!$AX$298:$AY$325,2),IF(AND(O52=\"zq\",'[1]PODEŠAVANJA-NE BRISATI'!$F$14=\"32>4\"),VLOOKUP(K52,[1]sema!$AX$326:$AY$353,2),IF(AND(O52=\"mq\",'[1]PODEŠAVANJA-NE BRISATI'!$F$13=\"32>8\"),VLOOKUP(K52,[1]sema!$AX$356:$AY$379,2),IF(AND(O52=\"zq\",'[1]PODEŠAVANJA-NE BRISATI'!$F$14=\"32>8\"),VLOOKUP(K52,[1]sema!$AX$380:$AY$403,2),IF(AND(O52=\"md\",'[1]PODEŠAVANJA-NE BRISATI'!$E$13=4),VLOOKUP(K52,[1]sema!$AX$406:$AY$408,2),IF(AND(O52=\"zd\",'[1]PODEŠAVANJA-NE BRISATI'!$E$14=4),VLOOKUP(K52,[1]sema!$AX$409:$AY$411,2),IF(AND(O52=\"md\",'[1]PODEŠAVANJA-NE BRISATI'!$E$13=8),VLOOKUP(K52,[1]sema!$AX$414:$AY$420,2),IF(AND(O52=\"zd\",'[1]PODEŠAVANJA-NE BRISATI'!$E$14=8),VLOOKUP(K52,[1]sema!$AX$421:$AY$427,2),IF(AND(O52=\"md\",'[1]PODEŠAVANJA-NE BRISATI'!$E$13=16),VLOOKUP(K52,[1]sema!$AX$430:$AY$444,2),IF(AND(O52=\"zd\",'[1]PODEŠAVANJA-NE BRISATI'!$E$14=8),VLOOKUP(K52,[1]sema!$AX$445:$AY$459,2))))))))))))))))))))))))))","v":""}]
[null,null,null,null,null,{"$f":"IF(AND(J52=\"m\",'[1]PODEŠAVANJA-NE BRISATI'!$D$13=8),UPPER(IF(F52=\"\",\"\",VLOOKUP(F52,[1]sema!$BA$7:$BI$13,8))),IF(AND(J52=\"z\",'[1]PODEŠAVANJA-NE BRISATI'!$D$14=8),UPPER(IF(F52=\"\",\"\",VLOOKUP(F52,[1]sema!$BA$14:$BI$20,8))),IF(AND(J52=\"m\",'[1]PODEŠAVANJA-NE BRISATI'!$D$13=16),UPPER(IF(F52=\"\",\"\",VLOOKUP(F52,[1]sema!$BA$22:$BI$36,8))),IF(AND(J52=\"z\",'[1]PODEŠAVANJA-NE BRISATI'!$D$14=16),UPPER(IF(F52=\"\",\"\",VLOOKUP(F52,[1]sema!$BA$37:$BI$51,8))),IF(AND(J52=\"m\",'[1]PODEŠAVANJA-NE BRISATI'!$D$13=32),UPPER(IF(F52=\"\",\"\",VLOOKUP(F52,[1]sema!$BA$53:$BI$83,8))),IF(AND(J52=\"z\",'[1]PODEŠAVANJA-NE BRISATI'!$D$14=32),UPPER(IF(F52=\"\",\"\",VLOOKUP(F52,[1]sema!$BA$84:$BI$114,8))),IF(AND(J52=\"m\",'[1]PODEŠAVANJA-NE BRISATI'!$D$13=64),UPPER(IF(F52=\"\",\"\",VLOOKUP(F52,[1]sema!$BA$116:$BI$178,8))),IF(AND(J52=\"z\",'[1]PODEŠAVANJA-NE BRISATI'!$D$14=64),UPPER(IF(F52=\"\",\"\",VLOOKUP(F52,[1]sema!$BA$179:$BI$241,8))),IF(AND(J52=\"mq\",'[1]PODEŠAVANJA-NE BRISATI'!$F$13=\"8>4\"),UPPER(IF(F52=\"\",\"\",VLOOKUP(F52,[1]sema!$BA$245:$BI$248,8))),IF(AND(J52=\"mq\",'[1]PODEŠAVANJA-NE BRISATI'!$F$13=\"16>4\"),UPPER(IF(F52=\"\",\"\",VLOOKUP(F52,[1]sema!$BA$254:$BI$265,8))),IF(AND(J52=\"mq\",'[1]PODEŠAVANJA-NE BRISATI'!$F$13=\"16>8\"),UPPER(IF(F52=\"\",\"\",VLOOKUP(F52,[1]sema!$BA$280:$BI$287,8))),IF(AND(J52=\"mq\",'[1]PODEŠAVANJA-NE BRISATI'!$F$13=\"32>4\"),UPPER(IF(F52=\"\",\"\",VLOOKUP(F52,[1]sema!$BA$298:$BI$325,8))),IF(AND(J52=\"mq\",'[1]PODEŠAVANJA-NE BRISATI'!$F$13=\"32>8\"),UPPER(IF(F52=\"\",\"\",VLOOKUP(F52,[1]sema!$BA$356:$BI$379,8))),IF(AND(J52=\"zq\",'[1]PODEŠAVANJA-NE BRISATI'!$F$14=\"8>4\"),UPPER(IF(F52=\"\",\"\",VLOOKUP(F52,[1]sema!$BA$249:$BI$252,8))),IF(AND(J52=\"zq\",'[1]PODEŠAVANJA-NE BRISATI'!$F$14=\"16>4\"),UPPER(IF(F52=\"\",\"\",VLOOKUP(F52,[1]sema!$BA$266:$BI$277,8))),IF(AND(J52=\"zq\",'[1]PODEŠAVANJA-NE BRISATI'!$F$14=\"16>8\"),UPPER(IF(F52=\"\",\"\",VLOOKUP(F52,[1]sema!$BA$288:$BI$295,8))),IF(AND(J52=\"zq\",'[1]PODEŠAVANJA-NE BRISATI'!$F$14=\"32>4\"),UPPER(IF(F52=\"\",\"\",VLOOKUP(F52,[1]sema!$BA$326:$BI$353,8))),IF(AND(J52=\"zq\",'[1]PODEŠAVANJA-NE BRISATI'!$F$14=\"32>8\"),UPPER(IF(F52=\"\",\"\",VLOOKUP(F52,[1]sema!$BA$380:$BI$403,8))),IF(AND(J52=\"md\",'[1]PODEŠAVANJA-NE BRISATI'!$E$13=4),UPPER(IF(F52=\"\",\"\",VLOOKUP(F52,[1]sema!$BA$406:$BK$408,8))),IF(AND(J52=\"zd\",'[1]PODEŠAVANJA-NE BRISATI'!$E$14=4),UPPER(IF(F52=\"\",\"\",VLOOKUP(F52,[1]sema!$BA$409:$BK$411,8))),IF(AND(J52=\"md\",'[1]PODEŠAVANJA-NE BRISATI'!$E$13=8),UPPER(IF(F52=\"\",\"\",VLOOKUP(F52,[1]sema!$BA$414:$BK$420,8))),IF(AND(J52=\"zd\",'[1]PODEŠAVANJA-NE BRISATI'!$E$14=8),UPPER(IF(F52=\"\",\"\",VLOOKUP(F52,[1]sema!$BA$421:$BK$427,8))),IF(AND(J52=\"md\",'[1]PODEŠAVANJA-NE BRISATI'!$E$13=16),UPPER(IF(F52=\"\",\"\",VLOOKUP(F52,[1]sema!$BA$430:$BK$444,8))),IF(AND(J52=\"zd\",'[1]PODEŠAVANJA-NE BRISATI'!$E$14=16),UPPER(IF(F52=\"\",\"\",VLOOKUP(F52,[1]sema!$BA$445:$BK$459,8))),\"\"))))))))))))))))))))))))","v":""},null,null,null,null,{"$f":"IF(AND(O52=\"m\",'[1]PODEŠAVANJA-NE BRISATI'!$D$13=8),UPPER(IF(K52=\"\",\"\",VLOOKUP(K52,[1]sema!$BA$7:$BI$13,8))),IF(AND(O52=\"z\",'[1]PODEŠAVANJA-NE BRISATI'!$D$14=8),UPPER(IF(K52=\"\",\"\",VLOOKUP(K52,[1]sema!$BA$14:$BI$20,8))),IF(AND(O52=\"m\",'[1]PODEŠAVANJA-NE BRISATI'!$D$13=16),UPPER(IF(K52=\"\",\"\",VLOOKUP(K52,[1]sema!$BA$22:$BI$36,8))),IF(AND(O52=\"z\",'[1]PODEŠAVANJA-NE BRISATI'!$D$14=16),UPPER(IF(K52=\"\",\"\",VLOOKUP(K52,[1]sema!$BA$37:$BI$51,8))),IF(AND(O52=\"m\",'[1]PODEŠAVANJA-NE BRISATI'!$D$13=32),UPPER(IF(K52=\"\",\"\",VLOOKUP(K52,[1]sema!$BA$53:$BI$83,8))),IF(AND(O52=\"z\",'[1]PODEŠAVANJA-NE BRISATI'!$D$14=32),UPPER(IF(K52=\"\",\"\",VLOOKUP(K52,[1]sema!$BA$84:$BI$114,8))),IF(AND(O52=\"m\",'[1]PODEŠAVANJA-NE BRISATI'!$D$13=64),UPPER(IF(K52=\"\",\"\",VLOOKUP(K52,[1]sema!$BA$116:$BI$178,8))),IF(AND(O52=\"z\",'[1]PODEŠAVANJA-NE BRISATI'!$D$14=64),UPPER(IF(K52=\"\",\"\",VLOOKUP(K52,[1]sema!$BA$179:$BI$241,8))),IF(AND(O52=\"mq\",'[1]PODEŠAVANJA-NE BRISATI'!$F$13=\"8>4\"),UPPER(IF(K52=\"\",\"\",VLOOKUP(K52,[1]sema!$BA$245:$BI$248,8))),IF(AND(O52=\"mq\",'[1]PODEŠAVANJA-NE BRISATI'!$F$13=\"16>4\"),UPPER(IF(K52=\"\",\"\",VLOOKUP(K52,[1]sema!$BA$254:$BI$265,8))),IF(AND(O52=\"mq\",'[1]PODEŠAVANJA-NE BRISATI'!$F$13=\"16>8\"),UPPER(IF(K52=\"\",\"\",VLOOKUP(K52,[1]sema!$BA$280:$BI$287,8))),IF(AND(O52=\"mq\",'[1]PODEŠAVANJA-NE BRISATI'!$F$13=\"32>4\"),UPPER(IF(K52=\"\",\"\",VLOOKUP(K52,[1]sema!$BA$298:$BI$325,8))),IF(AND(O52=\"mq\",'[1]PODEŠAVANJA-NE BRISATI'!$F$13=\"32>8\"),UPPER(IF(K52=\"\",\"\",VLOOKUP(K52,[1]sema!$BA$356:$BI$379,8))),IF(AND(O52=\"zq\",'[1]PODEŠAVANJA-NE BRISATI'!$F$14=\"8>4\"),UPPER(IF(K52=\"\",\"\",VLOOKUP(K52,[1]sema!$BA$249:$BI$252,8))),IF(AND(O52=\"zq\",'[1]PODEŠAVANJA-NE BRISATI'!$F$14=\"16>4\"),UPPER(IF(K52=\"\",\"\",VLOOKUP(K52,[1]sema!$BA$266:$BI$277,8))),IF(AND(O52=\"zq\",'[1]PODEŠAVANJA-NE BRISATI'!$F$14=\"16>8\"),UPPER(IF(K52=\"\",\"\",VLOOKUP(K52,[1]sema!$BA$288:$BI$295,8))),IF(AND(O52=\"zq\",'[1]PODEŠAVANJA-NE BRISATI'!$F$14=\"32>4\"),UPPER(IF(K52=\"\",\"\",VLOOKUP(K52,[1]sema!$BA$326:$BI$353,8))),IF(AND(O52=\"zq\",'[1]PODEŠAVANJA-NE BRISATI'!$F$14=\"32>8\"),UPPER(IF(K52=\"\",\"\",VLOOKUP(K52,[1]sema!$BA$380:$BI$403,8))),IF(AND(O52=\"md\",'[1]PODEŠAVANJA-NE BRISATI'!$E$13=4),UPPER(IF(K52=\"\",\"\",VLOOKUP(K52,[1]sema!$BA$406:$BK$408,8))),IF(AND(O52=\"zd\",'[1]PODEŠAVANJA-NE BRISATI'!$E$14=4),UPPER(IF(K52=\"\",\"\",VLOOKUP(K52,[1]sema!$BA$409:$BK$411,8))),IF(AND(O52=\"md\",'[1]PODEŠAVANJA-NE BRISATI'!$E$13=8),UPPER(IF(K52=\"\",\"\",VLOOKUP(K52,[1]sema!$BA$414:$BK$420,8))),IF(AND(O52=\"zd\",'[1]PODEŠAVANJA-NE BRISATI'!$E$14=8),UPPER(IF(K52=\"\",\"\",VLOOKUP(K52,[1]sema!$BA$421:$BK$427,8))),IF(AND(O52=\"md\",'[1]PODEŠAVANJA-NE BRISATI'!$E$13=16),UPPER(IF(K52=\"\",\"\",VLOOKUP(K52,[1]sema!$BA$430:$BK$444,8))),IF(AND(O52=\"zd\",'[1]PODEŠAVANJA-NE BRISATI'!$E$14=16),UPPER(IF(K52=\"\",\"\",VLOOKUP(K52,[1]sema!$BA$445:$BK$459,8))),\"\"))))))))))))))))))))))))","v":""}]
[]
[null,null,null,null,null,null,"vs.",null,null,{"$f":"MID(F52,3,2)","v":""},null,"vs.",null,null,{"$f":"MID(K52,3,2)","v":""}]
[]
[null,null,null,null,null,null,null,null,null,null,{"$f":"IF(AND(O52=\"m\",'[1]PODEŠAVANJA-NE BRISATI'!$D$13=8),UPPER(IF(K52=\"\",\"\",VLOOKUP(K52,[1]sema!$BA$7:$BI$13,9))),IF(AND(O52=\"z\",'[1]PODEŠAVANJA-NE BRISATI'!$D$14=8),UPPER(IF(K52=\"\",\"\",VLOOKUP(K52,[1]sema!$BA$14:$BI$20,9))),IF(AND(O52=\"m\",'[1]PODEŠAVANJA-NE BRISATI'!$D$13=16),UPPER(IF(K52=\"\",\"\",VLOOKUP(K52,[1]sema!$BA$22:$BI$36,9))),IF(AND(O52=\"z\",'[1]PODEŠAVANJA-NE BRISATI'!$D$14=16),UPPER(IF(K52=\"\",\"\",VLOOKUP(K52,[1]sema!$BA$37:$BI$51,9))),IF(AND(O52=\"m\",'[1]PODEŠAVANJA-NE BRISATI'!$D$13=32),UPPER(IF(K52=\"\",\"\",VLOOKUP(K52,[1]sema!$BA$53:$BI$83,9))),IF(AND(O52=\"z\",'[1]PODEŠAVANJA-NE BRISATI'!$D$14=32),UPPER(IF(K52=\"\",\"\",VLOOKUP(K52,[1]sema!$BA$84:$BI$114,9))),IF(AND(O52=\"m\",'[1]PODEŠAVANJA-NE BRISATI'!$D$13=64),UPPER(IF(K52=\"\",\"\",VLOOKUP(K52,[1]sema!$BA$116:$BI$178,9))),IF(AND(O52=\"z\",'[1]PODEŠAVANJA-NE BRISATI'!$D$14=64),UPPER(IF(K52=\"\",\"\",VLOOKUP(K52,[1]sema!$BA$179:$BI$241,9))),IF(AND(O52=\"mq\",'[1]PODEŠAVANJA-NE BRISATI'!$F$13=\"8>4\"),UPPER(IF(K52=\"\",\"\",VLOOKUP(K52,[1]sema!$BA$245:$BI$248,9))),IF(AND(O52=\"mq\",'[1]PODEŠAVANJA-NE BRISATI'!$F$13=\"16>4\"),UPPER(IF(K52=\"\",\"\",VLOOKUP(K52,[1]sema!$BA$254:$BI$265,9))),IF(AND(O52=\"mq\",'[1]PODEŠAVANJA-NE BRISATI'!$F$13=\"16>8\"),UPPER(IF(K52=\"\",\"\",VLOOKUP(K52,[1]sema!$BA$280:$BI$287,9))),IF(AND(O52=\"mq\",'[1]PODEŠAVANJA-NE BRISATI'!$F$13=\"32>4\"),UPPER(IF(K52=\"\",\"\",VLOOKUP(K52,[1]sema!$BA$298:$BI$325,9))),IF(AND(O52=\"mq\",'[1]PODEŠAVANJA-NE BRISATI'!$F$13=\"32>8\"),UPPER(IF(K52=\"\",\"\",VLOOKUP(K52,[1]sema!$BA$356:$BI$379,9))),IF(AND(O52=\"zq\",'[1]PODEŠAVANJA-NE BRISATI'!$F$14=\"8>4\"),UPPER(IF(K52=\"\",\"\",VLOOKUP(K52,[1]sema!$BA$249:$BI$252,9))),IF(AND(O52=\"zq\",'[1]PODEŠAVANJA-NE BRISATI'!$F$14=\"16>4\"),UPPER(IF(K52=\"\",\"\",VLOOKUP(K52,[1]sema!$BA$266:$BI$277,9))),IF(AND(O52=\"zq\",'[1]PODEŠAVANJA-NE BRISATI'!$F$14=\"16>8\"),UPPER(IF(K52=\"\",\"\",VLOOKUP(K52,[1]sema!$BA$288:$BI$295,9))),IF(AND(O52=\"zq\",'[1]PODEŠAVANJA-NE BRISATI'!$F$14=\"32>4\"),UPPER(IF(K52=\"\",\"\",VLOOKUP(K52,[1]sema!$BA$326:$BI$353,9))),IF(AND(O52=\"zq\",'[1]PODEŠAVANJA-NE BRISATI'!$F$14=\"32>8\"),UPPER(IF(K52=\"\",\"\",VLOOKUP(K52,[1]sema!$BA$380:$BI$403,9))),IF(AND(O52=\"md\",'[1]PODEŠAVANJA-NE BRISATI'!$E$13=4),UPPER(IF(K52=\"\",\"\",VLOOKUP(K52,[1]sema!$BA$406:$BK$408,11))),IF(AND(O52=\"zd\",'[1]PODEŠAVANJA-NE BRISATI'!$E$14=4),UPPER(IF(K52=\"\",\"\",VLOOKUP(K52,[1]sema!$BA$409:$BK$411,11))),IF(AND(O52=\"md\",'[1]PODEŠAVANJA-NE BRISATI'!$E$13=8),UPPER(IF(K52=\"\",\"\",VLOOKUP(K52,[1]sema!$BA$414:$BK$420,11))),IF(AND(O52=\"zd\",'[1]PODEŠAVANJA-NE BRISATI'!$E$14=8),UPPER(IF(K52=\"\",\"\",VLOOKUP(K52,[1]sema!$BA$421:$BK$427,11))),IF(AND(O52=\"md\",'[1]PODEŠAVANJA-NE BRISATI'!$E$13=16),UPPER(IF(K52=\"\",\"\",VLOOKUP(K52,[1]sema!$BA$430:$BK$444,11))),IF(AND(O52=\"zd\",'[1]PODEŠAVANJA-NE BRISATI'!$E$14=16),UPPER(IF(K52=\"\",\"\",VLOOKUP(K52,[1]sema!$BA$445:$BK$459,11))),\"\"))))))))))))))))))))))))","v":""}]
[]
[null,null,null,null,null,"NE PRE 18:30",null,null,null,null,"NE PRE 18:30"]
[null,null,null,null,"7. MEC",{"$f":"IF(ISBLANK(F60),\"\",IF(AND(J60=\"m\",'[1]PODEŠAVANJA-NE BRISATI'!$D$13=8),VLOOKUP(F60,[1]sema!$AX$7:$AY$13,2),IF(AND(J60=\"z\",'[1]PODEŠAVANJA-NE BRISATI'!$D$14=8),VLOOKUP(F60,[1]sema!$AX$14:$AY$20,2),IF(AND(J60=\"m\",'[1]PODEŠAVANJA-NE BRISATI'!$D$13=16),VLOOKUP(F60,[1]sema!$AX$22:$AY$36,2),IF(AND(J60=\"z\",'[1]PODEŠAVANJA-NE BRISATI'!$D$14=16),VLOOKUP(F60,[1]sema!$AX$37:$AY$51,2),IF(AND(J60=\"m\",'[1]PODEŠAVANJA-NE BRISATI'!$D$13=32),VLOOKUP(F60,[1]sema!$AX$53:$AY$83,2),IF(AND(J60=\"z\",'[1]PODEŠAVANJA-NE BRISATI'!$D$14=32),VLOOKUP(F60,[1]sema!$AX$84:$AY$114,2),IF(AND(J60=\"m\",'[1]PODEŠAVANJA-NE BRISATI'!$D$13=64),VLOOKUP(F60,[1]sema!$AX$116:$AY$178,2),IF(AND(J60=\"z\",'[1]PODEŠAVANJA-NE BRISATI'!$D$14=64),VLOOKUP(F60,[1]sema!$AX$179:$AY$241,2),IF(AND(J60=\"mq\",'[1]PODEŠAVANJA-NE BRISATI'!$F$13=\"8>4\"),VLOOKUP(F60,[1]sema!$AX$245:$AY$248,2),IF(AND(J60=\"zq\",'[1]PODEŠAVANJA-NE BRISATI'!$F$14=\"8>4\"),VLOOKUP(F60,[1]sema!$AX$249:$AY$252,2),IF(AND(J60=\"mq\",'[1]PODEŠAVANJA-NE BRISATI'!$F$13=\"16>4\"),VLOOKUP(F60,[1]sema!$AX$254:$AY$265,2),IF(AND(J60=\"zq\",'[1]PODEŠAVANJA-NE BRISATI'!$F$14=\"16>4\"),VLOOKUP(F60,[1]sema!$AX$266:$AY$277,2),IF(AND(J60=\"mq\",'[1]PODEŠAVANJA-NE BRISATI'!$F$13=\"16>8\"),VLOOKUP(F60,[1]sema!$AX$280:$AY$287,2),IF(AND(J60=\"zq\",'[1]PODEŠAVANJA-NE BRISATI'!$F$14=\"16>8\"),VLOOKUP(F60,[1]sema!$AX$288:$AY$295,2),IF(AND(J60=\"mq\",'[1]PODEŠAVANJA-NE BRISATI'!$F$13=\"32>4\"),VLOOKUP(F60,[1]sema!$AX$298:$AY$325,2),IF(AND(J60=\"zq\",'[1]PODEŠAVANJA-NE BRISATI'!$F$14=\"32>4\"),VLOOKUP(F60,[1]sema!$AX$326:$AY$353,2),IF(AND(J60=\"mq\",'[1]PODEŠAVANJA-NE BRISATI'!$F$13=\"32>8\"),VLOOKUP(F60,[1]sema!$AX$356:$AY$379,2),IF(AND(J60=\"zq\",'[1]PODEŠAVANJA-NE BRISATI'!$F$14=\"32>8\"),VLOOKUP(F60,[1]sema!$AX$380:$AY$403,2),IF(AND(J60=\"md\",'[1]PODEŠAVANJA-NE BRISATI'!$E$13=4),VLOOKUP(F60,[1]sema!$AX$406:$AY$408,2),IF(AND(J60=\"zd\",'[1]PODEŠAVANJA-NE BRISATI'!$E$14=4),VLOOKUP(F60,[1]sema!$AX$409:$AY$411,2),IF(AND(J60=\"md\",'[1]PODEŠAVANJA-NE BRISATI'!$E$13=8),VLOOKUP(F60,[1]sema!$AX$414:$AY$420,2),IF(AND(J60=\"zd\",'[1]PODEŠAVANJA-NE BRISATI'!$E$14=8),VLOOKUP(F60,[1]sema!$AX$421:$AY$427,2),IF(AND(J60=\"md\",'[1]PODEŠAVANJA-NE BRISATI'!$E$13=16),VLOOKUP(F60,[1]sema!$AX$430:$AY$444,2),IF(AND(J60=\"zd\",'[1]PODEŠAVANJA-NE BRISATI'!$E$14=8),VLOOKUP(F60,[1]sema!$AX$445:$AY$459,2))))))))))))))))))))))))))","v":""},null,null,null,null,{"$f":"IF(ISBLANK(K60),\"\",IF(AND(O60=\"m\",'[1]PODEŠAVANJA-NE BRISATI'!$D$13=8),VLOOKUP(K60,[1]sema!$AX$7:$AY$13,2),IF(AND(O60=\"z\",'[1]PODEŠAVANJA-NE BRISATI'!$D$14=8),VLOOKUP(K60,[1]sema!$AX$14:$AY$20,2),IF(AND(O60=\"m\",'[1]PODEŠAVANJA-NE BRISATI'!$D$13=16),VLOOKUP(K60,[1]sema!$AX$22:$AY$36,2),IF(AND(O60=\"z\",'[1]PODEŠAVANJA-NE BRISATI'!$D$14=16),VLOOKUP(K60,[1]sema!$AX$37:$AY$51,2),IF(AND(O60=\"m\",'[1]PODEŠAVANJA-NE BRISATI'!$D$13=32),VLOOKUP(K60,[1]sema!$AX$53:$AY$83,2),IF(AND(O60=\"z\",'[1]PODEŠAVANJA-NE BRISATI'!$D$14=32),VLOOKUP(K60,[1]sema!$AX$84:$AY$114,2),IF(AND(O60=\"m\",'[1]PODEŠAVANJA-NE BRISATI'!$D$13=64),VLOOKUP(K60,[1]sema!$AX$116:$AY$178,2),IF(AND(O60=\"z\",'[1]PODEŠAVANJA-NE BRISATI'!$D$14=64),VLOOKUP(K60,[1]sema!$AX$179:$AY$241,2),IF(AND(O60=\"mq\",'[1]PODEŠAVANJA-NE BRISATI'!$F$13=\"8>4\"),VLOOKUP(K60,[1]sema!$AX$245:$AY$248,2),IF(AND(O60=\"zq\",'[1]PODEŠAVANJA-NE BRISATI'!$F$14=\"8>4\"),VLOOKUP(K60,[1]sema!$AX$249:$AY$252,2),IF(AND(O60=\"mq\",'[1]PODEŠAVANJA-NE BRISATI'!$F$13=\"16>4\"),VLOOKUP(K60,[1]sema!$AX$254:$AY$265,2),IF(AND(O60=\"zq\",'[1]PODEŠAVANJA-NE BRISATI'!$F$14=\"16>4\"),VLOOKUP(K60,[1]sema!$AX$266:$AY$277,2),IF(AND(O60=\"mq\",'[1]PODEŠAVANJA-NE BRISATI'!$F$13=\"16>8\"),VLOOKUP(K60,[1]sema!$AX$280:$AY$287,2),IF(AND(O60=\"zq\",'[1]PODEŠAVANJA-NE BRISATI'!$F$14=\"16>8\"),VLOOKUP(K60,[1]sema!$AX$288:$AY$295,2),IF(AND(O60=\"mq\",'[1]PODEŠAVANJA-NE BRISATI'!$F$13=\"32>4\"),VLOOKUP(K60,[1]sema!$AX$298:$AY$325,2),IF(AND(O60=\"zq\",'[1]PODEŠAVANJA-NE BRISATI'!$F$14=\"32>4\"),VLOOKUP(K60,[1]sema!$AX$326:$AY$353,2),IF(AND(O60=\"mq\",'[1]PODEŠAVANJA-NE BRISATI'!$F$13=\"32>8\"),VLOOKUP(K60,[1]sema!$AX$356:$AY$379,2),IF(AND(O60=\"zq\",'[1]PODEŠAVANJA-NE BRISATI'!$F$14=\"32>8\"),VLOOKUP(K60,[1]sema!$AX$380:$AY$403,2),IF(AND(O60=\"md\",'[1]PODEŠAVANJA-NE BRISATI'!$E$13=4),VLOOKUP(K60,[1]sema!$AX$406:$AY$408,2),IF(AND(O60=\"zd\",'[1]PODEŠAVANJA-NE BRISATI'!$E$14=4),VLOOKUP(K60,[1]sema!$AX$409:$AY$411,2),IF(AND(O60=\"md\",'[1]PODEŠAVANJA-NE BRISATI'!$E$13=8),VLOOKUP(K60,[1]sema!$AX$414:$AY$420,2),IF(AND(O60=\"zd\",'[1]PODEŠAVANJA-NE BRISATI'!$E$14=8),VLOOKUP(K60,[1]sema!$AX$421:$AY$427,2),IF(AND(O60=\"md\",'[1]PODEŠAVANJA-NE BRISATI'!$E$13=16),VLOOKUP(K60,[1]sema!$AX$430:$AY$444,2),IF(AND(O60=\"zd\",'[1]PODEŠAVANJA-NE BRISATI'!$E$14=8),VLOOKUP(K60,[1]sema!$AX$445:$AY$459,2))))))))))))))))))))))))))","v":""}]
[null,null,null,null,null,{"$f":"IF(AND(J60=\"m\",'[1]PODEŠAVANJA-NE BRISATI'!$D$13=8),UPPER(IF(F60=\"\",\"\",VLOOKUP(F60,[1]sema!$BA$7:$BI$13,8))),IF(AND(J60=\"z\",'[1]PODEŠAVANJA-NE BRISATI'!$D$14=8),UPPER(IF(F60=\"\",\"\",VLOOKUP(F60,[1]sema!$BA$14:$BI$20,8))),IF(AND(J60=\"m\",'[1]PODEŠAVANJA-NE BRISATI'!$D$13=16),UPPER(IF(F60=\"\",\"\",VLOOKUP(F60,[1]sema!$BA$22:$BI$36,8))),IF(AND(J60=\"z\",'[1]PODEŠAVANJA-NE BRISATI'!$D$14=16),UPPER(IF(F60=\"\",\"\",VLOOKUP(F60,[1]sema!$BA$37:$BI$51,8))),IF(AND(J60=\"m\",'[1]PODEŠAVANJA-NE BRISATI'!$D$13=32),UPPER(IF(F60=\"\",\"\",VLOOKUP(F60,[1]sema!$BA$53:$BI$83,8))),IF(AND(J60=\"z\",'[1]PODEŠAVANJA-NE BRISATI'!$D$14=32),UPPER(IF(F60=\"\",\"\",VLOOKUP(F60,[1]sema!$BA$84:$BI$114,8))),IF(AND(J60=\"m\",'[1]PODEŠAVANJA-NE BRISATI'!$D$13=64),UPPER(IF(F60=\"\",\"\",VLOOKUP(F60,[1]sema!$BA$116:$BI$178,8))),IF(AND(J60=\"z\",'[1]PODEŠAVANJA-NE BRISATI'!$D$14=64),UPPER(IF(F60=\"\",\"\",VLOOKUP(F60,[1]sema!$BA$179:$BI$241,8))),IF(AND(J60=\"mq\",'[1]PODEŠAVANJA-NE BRISATI'!$F$13=\"8>4\"),UPPER(IF(F60=\"\",\"\",VLOOKUP(F60,[1]sema!$BA$245:$BI$248,8))),IF(AND(J60=\"mq\",'[1]PODEŠAVANJA-NE BRISATI'!$F$13=\"16>4\"),UPPER(IF(F60=\"\",\"\",VLOOKUP(F60,[1]sema!$BA$254:$BI$265,8))),IF(AND(J60=\"mq\",'[1]PODEŠAVANJA-NE BRISATI'!$F$13=\"16>8\"),UPPER(IF(F60=\"\",\"\",VLOOKUP(F60,[1]sema!$BA$280:$BI$287,8))),IF(AND(J60=\"mq\",'[1]PODEŠAVANJA-NE BRISATI'!$F$13=\"32>4\"),UPPER(IF(F60=\"\",\"\",VLOOKUP(F60,[1]sema!$BA$298:$BI$325,8))),IF(AND(J60=\"mq\",'[1]PODEŠAVANJA-NE BRISATI'!$F$13=\"32>8\"),UPPER(IF(F60=\"\",\"\",VLOOKUP(F60,[1]sema!$BA$356:$BI$379,8))),IF(AND(J60=\"zq\",'[1]PODEŠAVANJA-NE BRISATI'!$F$14=\"8>4\"),UPPER(IF(F60=\"\",\"\",VLOOKUP(F60,[1]sema!$BA$249:$BI$252,8))),IF(AND(J60=\"zq\",'[1]PODEŠAVANJA-NE BRISATI'!$F$14=\"16>4\"),UPPER(IF(F60=\"\",\"\",VLOOKUP(F60,[1]sema!$BA$266:$BI$277,8))),IF(AND(J60=\"zq\",'[1]PODEŠAVANJA-NE BRISATI'!$F$14=\"16>8\"),UPPER(IF(F60=\"\",\"\",VLOOKUP(F60,[1]sema!$BA$288:$BI$295,8))),IF(AND(J60=\"zq\",'[1]PODEŠAVANJA-NE BRISATI'!$F$14=\"32>4\"),UPPER(IF(F60=\"\",\"\",VLOOKUP(F60,[1]sema!$BA$326:$BI$353,8))),IF(AND(J60=\"zq\",'[1]PODEŠAVANJA-NE BRISATI'!$F$14=\"32>8\"),UPPER(IF(F60=\"\",\"\",VLOOKUP(F60,[1]sema!$BA$380:$BI$403,8))),IF(AND(J60=\"md\",'[1]PODEŠAVANJA-NE BRISATI'!$E$13=4),UPPER(IF(F60=\"\",\"\",VLOOKUP(F60,[1]sema!$BA$406:$BK$408,8))),IF(AND(J60=\"zd\",'[1]PODEŠAVANJA-NE BRISATI'!$E$14=4),UPPER(IF(F60=\"\",\"\",VLOOKUP(F60,[1]sema!$BA$409:$BK$411,8))),IF(AND(J60=\"md\",'[1]PODEŠAVANJA-NE BRISATI'!$E$13=8),UPPER(IF(F60=\"\",\"\",VLOOKUP(F60,[1]sema!$BA$414:$BK$420,8))),IF(AND(J60=\"zd\",'[1]PODEŠAVANJA-NE BRISATI'!$E$14=8),UPPER(IF(F60=\"\",\"\",VLOOKUP(F60,[1]sema!$BA$421:$BK$427,8))),IF(AND(J60=\"md\",'[1]PODEŠAVANJA-NE BRISATI'!$E$13=16),UPPER(IF(F60=\"\",\"\",VLOOKUP(F60,[1]sema!$BA$430:$BK$444,8))),IF(AND(J60=\"zd\",'[1]PODEŠAVANJA-NE BRISATI'!$E$14=16),UPPER(IF(F60=\"\",\"\",VLOOKUP(F60,[1]sema!$BA$445:$BK$459,8))),\"\"))))))))))))))))))))))))","v":""},null,null,null,null,{"$f":"IF(AND(O60=\"m\",'[1]PODEŠAVANJA-NE BRISATI'!$D$13=8),UPPER(IF(K60=\"\",\"\",VLOOKUP(K60,[1]sema!$BA$7:$BI$13,8))),IF(AND(O60=\"z\",'[1]PODEŠAVANJA-NE BRISATI'!$D$14=8),UPPER(IF(K60=\"\",\"\",VLOOKUP(K60,[1]sema!$BA$14:$BI$20,8))),IF(AND(O60=\"m\",'[1]PODEŠAVANJA-NE BRISATI'!$D$13=16),UPPER(IF(K60=\"\",\"\",VLOOKUP(K60,[1]sema!$BA$22:$BI$36,8))),IF(AND(O60=\"z\",'[1]PODEŠAVANJA-NE BRISATI'!$D$14=16),UPPER(IF(K60=\"\",\"\",VLOOKUP(K60,[1]sema!$BA$37:$BI$51,8))),IF(AND(O60=\"m\",'[1]PODEŠAVANJA-NE BRISATI'!$D$13=32),UPPER(IF(K60=\"\",\"\",VLOOKUP(K60,[1]sema!$BA$53:$BI$83,8))),IF(AND(O60=\"z\",'[1]PODEŠAVANJA-NE BRISATI'!$D$14=32),UPPER(IF(K60=\"\",\"\",VLOOKUP(K60,[1]sema!$BA$84:$BI$114,8))),IF(AND(O60=\"m\",'[1]PODEŠAVANJA-NE BRISATI'!$D$13=64),UPPER(IF(K60=\"\",\"\",VLOOKUP(K60,[1]sema!$BA$116:$BI$178,8))),IF(AND(O60=\"z\",'[1]PODEŠAVANJA-NE BRISATI'!$D$14=64),UPPER(IF(K60=\"\",\"\",VLOOKUP(K60,[1]sema!$BA$179:$BI$241,8))),IF(AND(O60=\"mq\",'[1]PODEŠAVANJA-NE BRISATI'!$F$13=\"8>4\"),UPPER(IF(K60=\"\",\"\",VLOOKUP(K60,[1]sema!$BA$245:$BI$248,8))),IF(AND(O60=\"mq\",'[1]PODEŠAVANJA-NE BRISATI'!$F$13=\"16>4\"),UPPER(IF(K60=\"\",\"\",VLOOKUP(K60,[1]sema!$BA$254:$BI$265,8))),IF(AND(O60=\"mq\",'[1]PODEŠAVANJA-NE BRISATI'!$F$13=\"16>8\"),UPPER(IF(K60=\"\",\"\",VLOOKUP(K60,[1]sema!$BA$280:$BI$287,8))),IF(AND(O60=\"mq\",'[1]PODEŠAVANJA-NE BRISATI'!$F$13=\"32>4\"),UPPER(IF(K60=\"\",\"\",VLOOKUP(K60,[1]sema!$BA$298:$BI$325,8))),IF(AND(O60=\"mq\",'[1]PODEŠAVANJA-NE BRISATI'!$F$13=\"32>8\"),UPPER(IF(K60=\"\",\"\",VLOOKUP(K60,[1]sema!$BA$356:$BI$379,8))),IF(AND(O60=\"zq\",'[1]PODEŠAVANJA-NE BRISATI'!$F$14=\"8>4\"),UPPER(IF(K60=\"\",\"\",VLOOKUP(K60,[1]sema!$BA$249:$BI$252,8))),IF(AND(O60=\"zq\",'[1]PODEŠAVANJA-NE BRISATI'!$F$14=\"16>4\"),UPPER(IF(K60=\"\",\"\",VLOOKUP(K60,[1]sema!$BA$266:$BI$277,8))),IF(AND(O60=\"zq\",'[1]PODEŠAVANJA-NE BRISATI'!$F$14=\"16>8\"),UPPER(IF(K60=\"\",\"\",VLOOKUP(K60,[1]sema!$BA$288:$BI$295,8))),IF(AND(O60=\"zq\",'[1]PODEŠAVANJA-NE BRISATI'!$F$14=\"32>4\"),UPPER(IF(K60=\"\",\"\",VLOOKUP(K60,[1]sema!$BA$326:$BI$353,8))),IF(AND(O60=\"zq\",'[1]PODEŠAVANJA-NE BRISATI'!$F$14=\"32>8\"),UPPER(IF(K60=\"\",\"\",VLOOKUP(K60,[1]sema!$BA$380:$BI$403,8))),IF(AND(O60=\"md\",'[1]PODEŠAVANJA-NE BRISATI'!$E$13=4),UPPER(IF(K60=\"\",\"\",VLOOKUP(K60,[1]sema!$BA$406:$BK$408,8))),IF(AND(O60=\"zd\",'[1]PODEŠAVANJA-NE BRISATI'!$E$14=4),UPPER(IF(K60=\"\",\"\",VLOOKUP(K60,[1]sema!$BA$409:$BK$411,8))),IF(AND(O60=\"md\",'[1]PODEŠAVANJA-NE BRISATI'!$E$13=8),UPPER(IF(K60=\"\",\"\",VLOOKUP(K60,[1]sema!$BA$414:$BK$420,8))),IF(AND(O60=\"zd\",'[1]PODEŠAVANJA-NE BRISATI'!$E$14=8),UPPER(IF(K60=\"\",\"\",VLOOKUP(K60,[1]sema!$BA$421:$BK$427,8))),IF(AND(O60=\"md\",'[1]PODEŠAVANJA-NE BRISATI'!$E$13=16),UPPER(IF(K60=\"\",\"\",VLOOKUP(K60,[1]sema!$BA$430:$BK$444,8))),IF(AND(O60=\"zd\",'[1]PODEŠAVANJA-NE BRISATI'!$E$14=16),UPPER(IF(K60=\"\",\"\",VLOOKUP(K60,[1]sema!$BA$445:$BK$459,8))),\"\"))))))))))))))))))))))))","v":""}]
[]
[null,null,null,null,null,null,"vs.",null,null,{"$f":"MID(F60,3,2)","v":""},null,"vs.",null,null,{"$f":"MID(K60,3,2)","v":""}]
[]
[null,null,null,null,null,{"$f":"IF(AND(J60=\"m\",'[1]PODEŠAVANJA-NE BRISATI'!$D$13=8),UPPER(IF(F60=\"\",\"\",VLOOKUP(F60,[1]sema!$BA$7:$BI$13,9))),IF(AND(J60=\"z\",'[1]PODEŠAVANJA-NE BRISATI'!$D$14=8),UPPER(IF(F60=\"\",\"\",VLOOKUP(F60,[1]sema!$BA$14:$BI$20,9))),IF(AND(J60=\"m\",'[1]PODEŠAVANJA-NE BRISATI'!$D$13=16),UPPER(IF(F60=\"\",\"\",VLOOKUP(F60,[1]sema!$BA$22:$BI$36,9))),IF(AND(J60=\"z\",'[1]PODEŠAVANJA-NE BRISATI'!$D$14=16),UPPER(IF(F60=\"\",\"\",VLOOKUP(F60,[1]sema!$BA$37:$BI$51,9))),IF(AND(J60=\"m\",'[1]PODEŠAVANJA-NE BRISATI'!$D$13=32),UPPER(IF(F60=\"\",\"\",VLOOKUP(F60,[1]sema!$BA$53:$BI$83,9))),IF(AND(J60=\"z\",'[1]PODEŠAVANJA-NE BRISATI'!$D$14=32),UPPER(IF(F60=\"\",\"\",VLOOKUP(F60,[1]sema!$BA$84:$BI$114,9))),IF(AND(J60=\"m\",'[1]PODEŠAVANJA-NE BRISATI'!$D$13=64),UPPER(IF(F60=\"\",\"\",VLOOKUP(F60,[1]sema!$BA$116:$BI$178,9))),IF(AND(J60=\"z\",'[1]PODEŠAVANJA-NE BRISATI'!$D$14=64),UPPER(IF(F60=\"\",\"\",VLOOKUP(F60,[1]sema!$BA$179:$BI$241,9))),IF(AND(J60=\"mq\",'[1]PODEŠAVANJA-NE BRISATI'!$F$13=\"8>4\"),UPPER(IF(F60=\"\",\"\",VLOOKUP(F60,[1]sema!$BA$245:$BI$248,9))),IF(AND(J60=\"mq\",'[1]PODEŠAVANJA-NE BRISATI'!$F$13=\"16>4\"),UPPER(IF(F60=\"\",\"\",VLOOKUP(F60,[1]sema!$BA$254:$BI$265,9))),IF(AND(J60=\"mq\",'[1]PODEŠAVANJA-NE BRISATI'!$F$13=\"16>8\"),UPPER(IF(F60=\"\",\"\",VLOOKUP(F60,[1]sema!$BA$280:$BI$287,9))),IF(AND(J60=\"mq\",'[1]PODEŠAVANJA-NE BRISATI'!$F$13=\"32>4\"),UPPER(IF(F60=\"\",\"\",VLOOKUP(F60,[1]sema!$BA$298:$BI$325,9))),IF(AND(J60=\"mq\",'[1]PODEŠAVANJA-NE BRISATI'!$F$13=\"32>8\"),UPPER(IF(F60=\"\",\"\",VLOOKUP(F60,[1]sema!$BA$356:$BI$379,9))),IF(AND(J60=\"zq\",'[1]PODEŠAVANJA-NE BRISATI'!$F$14=\"8>4\"),UPPER(IF(F60=\"\",\"\",VLOOKUP(F60,[1]sema!$BA$249:$BI$252,9))),IF(AND(J60=\"zq\",'[1]PODEŠAVANJA-NE BRISATI'!$F$14=\"16>4\"),UPPER(IF(F60=\"\",\"\",VLOOKUP(F60,[1]sema!$BA$266:$BI$277,9))),IF(AND(J60=\"zq\",'[1]PODEŠAVANJA-NE BRISATI'!$F$14=\"16>8\"),UPPER(IF(F60=\"\",\"\",VLOOKUP(F60,[1]sema!$BA$288:$BI$295,9))),IF(AND(J60=\"zq\",'[1]PODEŠAVANJA-NE BRISATI'!$F$14=\"32>4\"),UPPER(IF(F60=\"\",\"\",VLOOKUP(F60,[1]sema!$BA$326:$BI$353,9))),IF(AND(J60=\"zq\",'[1]PODEŠAVANJA-NE BRISATI'!$F$14=\"32>8\"),UPPER(IF(F60=\"\",\"\",VLOOKUP(F60,[1]sema!$BA$380:$BI$403,9))),IF(AND(J60=\"md\",'[1]PODEŠAVANJA-NE BRISATI'!$E$13=4),UPPER(IF(F60=\"\",\"\",VLOOKUP(F60,[1]sema!$BA$406:$BK$408,11))),IF(AND(J60=\"zd\",'[1]PODEŠAVANJA-NE BRISATI'!$E$14=4),UPPER(IF(F60=\"\",\"\",VLOOKUP(F60,[1]sema!$BA$409:$BK$411,11))),IF(AND(J60=\"md\",'[1]PODEŠAVANJA-NE BRISATI'!$E$13=8),UPPER(IF(F60=\"\",\"\",VLOOKUP(F60,[1]sema!$BA$414:$BK$420,11))),IF(AND(J60=\"zd\",'[1]PODEŠAVANJA-NE BRISATI'!$E$14=8),UPPER(IF(F60=\"\",\"\",VLOOKUP(F60,[1]sema!$BA$421:$BK$427,11))),IF(AND(J60=\"md\",'[1]PODEŠAVANJA-NE BRISATI'!$E$13=16),UPPER(IF(F60=\"\",\"\",VLOOKUP(F60,[1]sema!$BA$430:$BK$444,11))),IF(AND(J60=\"zd\",'[1]PODEŠAVANJA-NE BRISATI'!$E$14=16),UPPER(IF(F60=\"\",\"\",VLOOKUP(F60,[1]sema!$BA$445:$BK$459,11))),\"\"))))))))))))))))))))))))","v":""},null,null,null,null,{"$f":"IF(AND(O60=\"m\",'[1]PODEŠAVANJA-NE BRISATI'!$D$13=8),UPPER(IF(K60=\"\",\"\",VLOOKUP(K60,[1]sema!$BA$7:$BI$13,9))),IF(AND(O60=\"z\",'[1]PODEŠAVANJA-NE BRISATI'!$D$14=8),UPPER(IF(K60=\"\",\"\",VLOOKUP(K60,[1]sema!$BA$14:$BI$20,9))),IF(AND(O60=\"m\",'[1]PODEŠAVANJA-NE BRISATI'!$D$13=16),UPPER(IF(K60=\"\",\"\",VLOOKUP(K60,[1]sema!$BA$22:$BI$36,9))),IF(AND(O60=\"z\",'[1]PODEŠAVANJA-NE BRISATI'!$D$14=16),UPPER(IF(K60=\"\",\"\",VLOOKUP(K60,[1]sema!$BA$37:$BI$51,9))),IF(AND(O60=\"m\",'[1]PODEŠAVANJA-NE BRISATI'!$D$13=32),UPPER(IF(K60=\"\",\"\",VLOOKUP(K60,[1]sema!$BA$53:$BI$83,9))),IF(AND(O60=\"z\",'[1]PODEŠAVANJA-NE BRISATI'!$D$14=32),UPPER(IF(K60=\"\",\"\",VLOOKUP(K60,[1]sema!$BA$84:$BI$114,9))),IF(AND(O60=\"m\",'[1]PODEŠAVANJA-NE BRISATI'!$D$13=64),UPPER(IF(K60=\"\",\"\",VLOOKUP(K60,[1]sema!$BA$116:$BI$178,9))),IF(AND(O60=\"z\",'[1]PODEŠAVANJA-NE BRISATI'!$D$14=64),UPPER(IF(K60=\"\",\"\",VLOOKUP(K60,[1]sema!$BA$179:$BI$241,9))),IF(AND(O60=\"mq\",'[1]PODEŠAVANJA-NE BRISATI'!$F$13=\"8>4\"),UPPER(IF(K60=\"\",\"\",VLOOKUP(K60,[1]sema!$BA$245:$BI$248,9))),IF(AND(O60=\"mq\",'[1]PODEŠAVANJA-NE BRISATI'!$F$13=\"16>4\"),UPPER(IF(K60=\"\",\"\",VLOOKUP(K60,[1]sema!$BA$254:$BI$265,9))),IF(AND(O60=\"mq\",'[1]PODEŠAVANJA-NE BRISATI'!$F$13=\"16>8\"),UPPER(IF(K60=\"\",\"\",VLOOKUP(K60,[1]sema!$BA$280:$BI$287,9))),IF(AND(O60=\"mq\",'[1]PODEŠAVANJA-NE BRISATI'!$F$13=\"32>4\"),UPPER(IF(K60=\"\",\"\",VLOOKUP(K60,[1]sema!$BA$298:$BI$325,9))),IF(AND(O60=\"mq\",'[1]PODEŠAVANJA-NE BRISATI'!$F$13=\"32>8\"),UPPER(IF(K60=\"\",\"\",VLOOKUP(K60,[1]sema!$BA$356:$BI$379,9))),IF(AND(O60=\"zq\",'[1]PODEŠAVANJA-NE BRISATI'!$F$14=\"8>4\"),UPPER(IF(K60=\"\",\"\",VLOOKUP(K60,[1]sema!$BA$249:$BI$252,9))),IF(AND(O60=\"zq\",'[1]PODEŠAVANJA-NE BRISATI'!$F$14=\"16>4\"),UPPER(IF(K60=\"\",\"\",VLOOKUP(K60,[1]sema!$BA$266:$BI$277,9))),IF(AND(O60=\"zq\",'[1]PODEŠAVANJA-NE BRISATI'!$F$14=\"16>8\"),UPPER(IF(K60=\"\",\"\",VLOOKUP(K60,[1]sema!$BA$288:$BI$295,9))),IF(AND(O60=\"zq\",'[1]PODEŠAVANJA-NE BRISATI'!$F$14=\"32>4\"),UPPER(IF(K60=\"\",\"\",VLOOKUP(K60,[1]sema!$BA$326:$BI$353,9))),IF(AND(O60=\"zq\",'[1]PODEŠAVANJA-NE BRISATI'!$F$14=\"32>8\"),UPPER(IF(K60=\"\",\"\",VLOOKUP(K60,[1]sema!$BA$380:$BI$403,9))),IF(AND(O60=\"md\",'[1]PODEŠAVANJA-NE BRISATI'!$E$13=4),UPPER(IF(K60=\"\",\"\",VLOOKUP(K60,[1]sema!$BA$406:$BK$408,11))),IF(AND(O60=\"zd\",'[1]PODEŠAVANJA-NE BRISATI'!$E$14=4),UPPER(IF(K60=\"\",\"\",VLOOKUP(K60,[1]sema!$BA$409:$BK$411,11))),IF(AND(O60=\"md\",'[1]PODEŠAVANJA-NE BRISATI'!$E$13=8),UPPER(IF(K60=\"\",\"\",VLOOKUP(K60,[1]sema!$BA$414:$BK$420,11))),IF(AND(O60=\"zd\",'[1]PODEŠAVANJA-NE BRISATI'!$E$14=8),UPPER(IF(K60=\"\",\"\",VLOOKUP(K60,[1]sema!$BA$421:$BK$427,11))),IF(AND(O60=\"md\",'[1]PODEŠAVANJA-NE BRISATI'!$E$13=16),UPPER(IF(K60=\"\",\"\",VLOOKUP(K60,[1]sema!$BA$430:$BK$444,11))),IF(AND(O60=\"zd\",'[1]PODEŠAVANJA-NE BRISATI'!$E$14=16),UPPER(IF(K60=\"\",\"\",VLOOKUP(K60,[1]sema!$BA$445:$BK$459,11))),\"\"))))))))))))))))))))))))","v":""}]
[]
[null,null,null,null,null,"NE PRE 19:30"]
[null,null,null,null,"8. MEC",{"$f":"IF(ISBLANK(F68),\"\",IF(AND(J68=\"m\",'[1]PODEŠAVANJA-NE BRISATI'!$D$13=8),VLOOKUP(F68,[1]sema!$AX$7:$AY$13,2),IF(AND(J68=\"z\",'[1]PODEŠAVANJA-NE BRISATI'!$D$14=8),VLOOKUP(F68,[1]sema!$AX$14:$AY$20,2),IF(AND(J68=\"m\",'[1]PODEŠAVANJA-NE BRISATI'!$D$13=16),VLOOKUP(F68,[1]sema!$AX$22:$AY$36,2),IF(AND(J68=\"z\",'[1]PODEŠAVANJA-NE BRISATI'!$D$14=16),VLOOKUP(F68,[1]sema!$AX$37:$AY$51,2),IF(AND(J68=\"m\",'[1]PODEŠAVANJA-NE BRISATI'!$D$13=32),VLOOKUP(F68,[1]sema!$AX$53:$AY$83,2),IF(AND(J68=\"z\",'[1]PODEŠAVANJA-NE BRISATI'!$D$14=32),VLOOKUP(F68,[1]sema!$AX$84:$AY$114,2),IF(AND(J68=\"m\",'[1]PODEŠAVANJA-NE BRISATI'!$D$13=64),VLOOKUP(F68,[1]sema!$AX$116:$AY$178,2),IF(AND(J68=\"z\",'[1]PODEŠAVANJA-NE BRISATI'!$D$14=64),VLOOKUP(F68,[1]sema!$AX$179:$AY$241,2),IF(AND(J68=\"mq\",'[1]PODEŠAVANJA-NE BRISATI'!$F$13=\"8>4\"),VLOOKUP(F68,[1]sema!$AX$245:$AY$248,2),IF(AND(J68=\"zq\",'[1]PODEŠAVANJA-NE BRISATI'!$F$14=\"8>4\"),VLOOKUP(F68,[1]sema!$AX$249:$AY$252,2),IF(AND(J68=\"mq\",'[1]PODEŠAVANJA-NE BRISATI'!$F$13=\"16>4\"),VLOOKUP(F68,[1]sema!$AX$254:$AY$265,2),IF(AND(J68=\"zq\",'[1]PODEŠAVANJA-NE BRISATI'!$F$14=\"16>4\"),VLOOKUP(F68,[1]sema!$AX$266:$AY$277,2),IF(AND(J68=\"mq\",'[1]PODEŠAVANJA-NE BRISATI'!$F$13=\"16>8\"),VLOOKUP(F68,[1]sema!$AX$280:$AY$287,2),IF(AND(J68=\"zq\",'[1]PODEŠAVANJA-NE BRISATI'!$F$14=\"16>8\"),VLOOKUP(F68,[1]sema!$AX$288:$AY$295,2),IF(AND(J68=\"mq\",'[1]PODEŠAVANJA-NE BRISATI'!$F$13=\"32>4\"),VLOOKUP(F68,[1]sema!$AX$298:$AY$325,2),IF(AND(J68=\"zq\",'[1]PODEŠAVANJA-NE BRISATI'!$F$14=\"32>4\"),VLOOKUP(F68,[1]sema!$AX$326:$AY$353,2),IF(AND(J68=\"mq\",'[1]PODEŠAVANJA-NE BRISATI'!$F$13=\"32>8\"),VLOOKUP(F68,[1]sema!$AX$356:$AY$379,2),IF(AND(J68=\"zq\",'[1]PODEŠAVANJA-NE BRISATI'!$F$14=\"32>8\"),VLOOKUP(F68,[1]sema!$AX$380:$AY$403,2),IF(AND(J68=\"md\",'[1]PODEŠAVANJA-NE BRISATI'!$E$13=4),VLOOKUP(F68,[1]sema!$AX$406:$AY$408,2),IF(AND(J68=\"zd\",'[1]PODEŠAVANJA-NE BRISATI'!$E$14=4),VLOOKUP(F68,[1]sema!$AX$409:$AY$411,2),IF(AND(J68=\"md\",'[1]PODEŠAVANJA-NE BRISATI'!$E$13=8),VLOOKUP(F68,[1]sema!$AX$414:$AY$420,2),IF(AND(J68=\"zd\",'[1]PODEŠAVANJA-NE BRISATI'!$E$14=8),VLOOKUP(F68,[1]sema!$AX$421:$AY$427,2),IF(AND(J68=\"md\",'[1]PODEŠAVANJA-NE BRISATI'!$E$13=16),VLOOKUP(F68,[1]sema!$AX$430:$AY$444,2),IF(AND(J68=\"zd\",'[1]PODEŠAVANJA-NE BRISATI'!$E$14=8),VLOOKUP(F68,[1]sema!$AX$445:$AY$459,2))))))))))))))))))))))))))","v":""},null,null,null,null,{"$f":"IF(ISBLANK(K68),\"\",IF(AND(O68=\"m\",'[1]PODEŠAVANJA-NE BRISATI'!$D$13=8),VLOOKUP(K68,[1]sema!$AX$7:$AY$13,2),IF(AND(O68=\"z\",'[1]PODEŠAVANJA-NE BRISATI'!$D$14=8),VLOOKUP(K68,[1]sema!$AX$14:$AY$20,2),IF(AND(O68=\"m\",'[1]PODEŠAVANJA-NE BRISATI'!$D$13=16),VLOOKUP(K68,[1]sema!$AX$22:$AY$36,2),IF(AND(O68=\"z\",'[1]PODEŠAVANJA-NE BRISATI'!$D$14=16),VLOOKUP(K68,[1]sema!$AX$37:$AY$51,2),IF(AND(O68=\"m\",'[1]PODEŠAVANJA-NE BRISATI'!$D$13=32),VLOOKUP(K68,[1]sema!$AX$53:$AY$83,2),IF(AND(O68=\"z\",'[1]PODEŠAVANJA-NE BRISATI'!$D$14=32),VLOOKUP(K68,[1]sema!$AX$84:$AY$114,2),IF(AND(O68=\"m\",'[1]PODEŠAVANJA-NE BRISATI'!$D$13=64),VLOOKUP(K68,[1]sema!$AX$116:$AY$178,2),IF(AND(O68=\"z\",'[1]PODEŠAVANJA-NE BRISATI'!$D$14=64),VLOOKUP(K68,[1]sema!$AX$179:$AY$241,2),IF(AND(O68=\"mq\",'[1]PODEŠAVANJA-NE BRISATI'!$F$13=\"8>4\"),VLOOKUP(K68,[1]sema!$AX$245:$AY$248,2),IF(AND(O68=\"zq\",'[1]PODEŠAVANJA-NE BRISATI'!$F$14=\"8>4\"),VLOOKUP(K68,[1]sema!$AX$249:$AY$252,2),IF(AND(O68=\"mq\",'[1]PODEŠAVANJA-NE BRISATI'!$F$13=\"16>4\"),VLOOKUP(K68,[1]sema!$AX$254:$AY$265,2),IF(AND(O68=\"zq\",'[1]PODEŠAVANJA-NE BRISATI'!$F$14=\"16>4\"),VLOOKUP(K68,[1]sema!$AX$266:$AY$277,2),IF(AND(O68=\"mq\",'[1]PODEŠAVANJA-NE BRISATI'!$F$13=\"16>8\"),VLOOKUP(K68,[1]sema!$AX$280:$AY$287,2),IF(AND(O68=\"zq\",'[1]PODEŠAVANJA-NE BRISATI'!$F$14=\"16>8\"),VLOOKUP(K68,[1]sema!$AX$288:$AY$295,2),IF(AND(O68=\"mq\",'[1]PODEŠAVANJA-NE BRISATI'!$F$13=\"32>4\"),VLOOKUP(K68,[1]sema!$AX$298:$AY$325,2),IF(AND(O68=\"zq\",'[1]PODEŠAVANJA-NE BRISATI'!$F$14=\"32>4\"),VLOOKUP(K68,[1]sema!$AX$326:$AY$353,2),IF(AND(O68=\"mq\",'[1]PODEŠAVANJA-NE BRISATI'!$F$13=\"32>8\"),VLOOKUP(K68,[1]sema!$AX$356:$AY$379,2),IF(AND(O68=\"zq\",'[1]PODEŠAVANJA-NE BRISATI'!$F$14=\"32>8\"),VLOOKUP(K68,[1]sema!$AX$380:$AY$403,2),IF(AND(O68=\"md\",'[1]PODEŠAVANJA-NE BRISATI'!$E$13=4),VLOOKUP(K68,[1]sema!$AX$406:$AY$408,2),IF(AND(O68=\"zd\",'[1]PODEŠAVANJA-NE BRISATI'!$E$14=4),VLOOKUP(K68,[1]sema!$AX$409:$AY$411,2),IF(AND(O68=\"md\",'[1]PODEŠAVANJA-NE BRISATI'!$E$13=8),VLOOKUP(K68,[1]sema!$AX$414:$AY$420,2),IF(AND(O68=\"zd\",'[1]PODEŠAVANJA-NE BRISATI'!$E$14=8),VLOOKUP(K68,[1]sema!$AX$421:$AY$427,2),IF(AND(O68=\"md\",'[1]PODEŠAVANJA-NE BRISATI'!$E$13=16),VLOOKUP(K68,[1]sema!$AX$430:$AY$444,2),IF(AND(O68=\"zd\",'[1]PODEŠAVANJA-NE BRISATI'!$E$14=8),VLOOKUP(K68,[1]sema!$AX$445:$AY$459,2))))))))))))))))))))))))))","v":""}]
[null,null,null,null,null,{"$f":"IF(AND(J68=\"m\",'[1]PODEŠAVANJA-NE BRISATI'!$D$13=8),UPPER(IF(F68=\"\",\"\",VLOOKUP(F68,[1]sema!$BA$7:$BI$13,8))),IF(AND(J68=\"z\",'[1]PODEŠAVANJA-NE BRISATI'!$D$14=8),UPPER(IF(F68=\"\",\"\",VLOOKUP(F68,[1]sema!$BA$14:$BI$20,8))),IF(AND(J68=\"m\",'[1]PODEŠAVANJA-NE BRISATI'!$D$13=16),UPPER(IF(F68=\"\",\"\",VLOOKUP(F68,[1]sema!$BA$22:$BI$36,8))),IF(AND(J68=\"z\",'[1]PODEŠAVANJA-NE BRISATI'!$D$14=16),UPPER(IF(F68=\"\",\"\",VLOOKUP(F68,[1]sema!$BA$37:$BI$51,8))),IF(AND(J68=\"m\",'[1]PODEŠAVANJA-NE BRISATI'!$D$13=32),UPPER(IF(F68=\"\",\"\",VLOOKUP(F68,[1]sema!$BA$53:$BI$83,8))),IF(AND(J68=\"z\",'[1]PODEŠAVANJA-NE BRISATI'!$D$14=32),UPPER(IF(F68=\"\",\"\",VLOOKUP(F68,[1]sema!$BA$84:$BI$114,8))),IF(AND(J68=\"m\",'[1]PODEŠAVANJA-NE BRISATI'!$D$13=64),UPPER(IF(F68=\"\",\"\",VLOOKUP(F68,[1]sema!$BA$116:$BI$178,8))),IF(AND(J68=\"z\",'[1]PODEŠAVANJA-NE BRISATI'!$D$14=64),UPPER(IF(F68=\"\",\"\",VLOOKUP(F68,[1]sema!$BA$179:$BI$241,8))),IF(AND(J68=\"mq\",'[1]PODEŠAVANJA-NE BRISATI'!$F$13=\"8>4\"),UPPER(IF(F68=\"\",\"\",VLOOKUP(F68,[1]sema!$BA$245:$BI$248,8))),IF(AND(J68=\"mq\",'[1]PODEŠAVANJA-NE BRISATI'!$F$13=\"16>4\"),UPPER(IF(F68=\"\",\"\",VLOOKUP(F68,[1]sema!$BA$254:$BI$265,8))),IF(AND(J68=\"mq\",'[1]PODEŠAVANJA-NE BRISATI'!$F$13=\"16>8\"),UPPER(IF(F68=\"\",\"\",VLOOKUP(F68,[1]sema!$BA$280:$BI$287,8))),IF(AND(J68=\"mq\",'[1]PODEŠAVANJA-NE BRISATI'!$F$13=\"32>4\"),UPPER(IF(F68=\"\",\"\",VLOOKUP(F68,[1]sema!$BA$298:$BI$325,8))),IF(AND(J68=\"mq\",'[1]PODEŠAVANJA-NE BRISATI'!$F$13=\"32>8\"),UPPER(IF(F68=\"\",\"\",VLOOKUP(F68,[1]sema!$BA$356:$BI$379,8))),IF(AND(J68=\"zq\",'[1]PODEŠAVANJA-NE BRISATI'!$F$14=\"8>4\"),UPPER(IF(F68=\"\",\"\",VLOOKUP(F68,[1]sema!$BA$249:$BI$252,8))),IF(AND(J68=\"zq\",'[1]PODEŠAVANJA-NE BRISATI'!$F$14=\"16>4\"),UPPER(IF(F68=\"\",\"\",VLOOKUP(F68,[1]sema!$BA$266:$BI$277,8))),IF(AND(J68=\"zq\",'[1]PODEŠAVANJA-NE BRISATI'!$F$14=\"16>8\"),UPPER(IF(F68=\"\",\"\",VLOOKUP(F68,[1]sema!$BA$288:$BI$295,8))),IF(AND(J68=\"zq\",'[1]PODEŠAVANJA-NE BRISATI'!$F$14=\"32>4\"),UPPER(IF(F68=\"\",\"\",VLOOKUP(F68,[1]sema!$BA$326:$BI$353,8))),IF(AND(J68=\"zq\",'[1]PODEŠAVANJA-NE BRISATI'!$F$14=\"32>8\"),UPPER(IF(F68=\"\",\"\",VLOOKUP(F68,[1]sema!$BA$380:$BI$403,8))),IF(AND(J68=\"md\",'[1]PODEŠAVANJA-NE BRISATI'!$E$13=4),UPPER(IF(F68=\"\",\"\",VLOOKUP(F68,[1]sema!$BA$406:$BK$408,8))),IF(AND(J68=\"zd\",'[1]PODEŠAVANJA-NE BRISATI'!$E$14=4),UPPER(IF(F68=\"\",\"\",VLOOKUP(F68,[1]sema!$BA$409:$BK$411,8))),IF(AND(J68=\"md\",'[1]PODEŠAVANJA-NE BRISATI'!$E$13=8),UPPER(IF(F68=\"\",\"\",VLOOKUP(F68,[1]sema!$BA$414:$BK$420,8))),IF(AND(J68=\"zd\",'[1]PODEŠAVANJA-NE BRISATI'!$E$14=8),UPPER(IF(F68=\"\",\"\",VLOOKUP(F68,[1]sema!$BA$421:$BK$427,8))),IF(AND(J68=\"md\",'[1]PODEŠAVANJA-NE BRISATI'!$E$13=16),UPPER(IF(F68=\"\",\"\",VLOOKUP(F68,[1]sema!$BA$430:$BK$444,8))),IF(AND(J68=\"zd\",'[1]PODEŠAVANJA-NE BRISATI'!$E$14=16),UPPER(IF(F68=\"\",\"\",VLOOKUP(F68,[1]sema!$BA$445:$BK$459,8))),\"\"))))))))))))))))))))))))","v":""},null,null,null,null,{"$f":"IF(AND(O68=\"m\",'[1]PODEŠAVANJA-NE BRISATI'!$D$13=8),UPPER(IF(K68=\"\",\"\",VLOOKUP(K68,[1]sema!$BA$7:$BI$13,8))),IF(AND(O68=\"z\",'[1]PODEŠAVANJA-NE BRISATI'!$D$14=8),UPPER(IF(K68=\"\",\"\",VLOOKUP(K68,[1]sema!$BA$14:$BI$20,8))),IF(AND(O68=\"m\",'[1]PODEŠAVANJA-NE BRISATI'!$D$13=16),UPPER(IF(K68=\"\",\"\",VLOOKUP(K68,[1]sema!$BA$22:$BI$36,8))),IF(AND(O68=\"z\",'[1]PODEŠAVANJA-NE BRISATI'!$D$14=16),UPPER(IF(K68=\"\",\"\",VLOOKUP(K68,[1]sema!$BA$37:$BI$51,8))),IF(AND(O68=\"m\",'[1]PODEŠAVANJA-NE BRISATI'!$D$13=32),UPPER(IF(K68=\"\",\"\",VLOOKUP(K68,[1]sema!$BA$53:$BI$83,8))),IF(AND(O68=\"z\",'[1]PODEŠAVANJA-NE BRISATI'!$D$14=32),UPPER(IF(K68=\"\",\"\",VLOOKUP(K68,[1]sema!$BA$84:$BI$114,8))),IF(AND(O68=\"m\",'[1]PODEŠAVANJA-NE BRISATI'!$D$13=64),UPPER(IF(K68=\"\",\"\",VLOOKUP(K68,[1]sema!$BA$116:$BI$178,8))),IF(AND(O68=\"z\",'[1]PODEŠAVANJA-NE BRISATI'!$D$14=64),UPPER(IF(K68=\"\",\"\",VLOOKUP(K68,[1]sema!$BA$179:$BI$241,8))),IF(AND(O68=\"mq\",'[1]PODEŠAVANJA-NE BRISATI'!$F$13=\"8>4\"),UPPER(IF(K68=\"\",\"\",VLOOKUP(K68,[1]sema!$BA$245:$BI$248,8))),IF(AND(O68=\"mq\",'[1]PODEŠAVANJA-NE BRISATI'!$F$13=\"16>4\"),UPPER(IF(K68=\"\",\"\",VLOOKUP(K68,[1]sema!$BA$254:$BI$265,8))),IF(AND(O68=\"mq\",'[1]PODEŠAVANJA-NE BRISATI'!$F$13=\"16>8\"),UPPER(IF(K68=\"\",\"\",VLOOKUP(K68,[1]sema!$BA$280:$BI$287,8))),IF(AND(O68=\"mq\",'[1]PODEŠAVANJA-NE BRISATI'!$F$13=\"32>4\"),UPPER(IF(K68=\"\",\"\",VLOOKUP(K68,[1]sema!$BA$298:$BI$325,8))),IF(AND(O68=\"mq\",'[1]PODEŠAVANJA-NE BRISATI'!$F$13=\"32>8\"),UPPER(IF(K68=\"\",\"\",VLOOKUP(K68,[1]sema!$BA$356:$BI$379,8))),IF(AND(O68=\"zq\",'[1]PODEŠAVANJA-NE BRISATI'!$F$14=\"8>4\"),UPPER(IF(K68=\"\",\"\",VLOOKUP(K68,[1]sema!$BA$249:$BI$252,8))),IF(AND(O68=\"zq\",'[1]PODEŠAVANJA-NE BRISATI'!$F$14=\"16>4\"),UPPER(IF(K68=\"\",\"\",VLOOKUP(K68,[1]sema!$BA$266:$BI$277,8))),IF(AND(O68=\"zq\",'[1]PODEŠAVANJA-NE BRISATI'!$F$14=\"16>8\"),UPPER(IF(K68=\"\",\"\",VLOOKUP(K68,[1]sema!$BA$288:$BI$295,8))),IF(AND(O68=\"zq\",'[1]PODEŠAVANJA-NE BRISATI'!$F$14=\"32>4\"),UPPER(IF(K68=\"\",\"\",VLOOKUP(K68,[1]sema!$BA$326:$BI$353,8))),IF(AND(O68=\"zq\",'[1]PODEŠAVANJA-NE BRISATI'!$F$14=\"32>8\"),UPPER(IF(K68=\"\",\"\",VLOOKUP(K68,[1]sema!$BA$380:$BI$403,8))),IF(AND(O68=\"md\",'[1]PODEŠAVANJA-NE BRISATI'!$E$13=4),UPPER(IF(K68=\"\",\"\",VLOOKUP(K68,[1]sema!$BA$406:$BK$408,8))),IF(AND(O68=\"zd\",'[1]PODEŠAVANJA-NE BRISATI'!$E$14=4),UPPER(IF(K68=\"\",\"\",VLOOKUP(K68,[1]sema!$BA$409:$BK$411,8))),IF(AND(O68=\"md\",'[1]PODEŠAVANJA-NE BRISATI'!$E$13=8),UPPER(IF(K68=\"\",\"\",VLOOKUP(K68,[1]sema!$BA$414:$BK$420,8))),IF(AND(O68=\"zd\",'[1]PODEŠAVANJA-NE BRISATI'!$E$14=8),UPPER(IF(K68=\"\",\"\",VLOOKUP(K68,[1]sema!$BA$421:$BK$427,8))),IF(AND(O68=\"md\",'[1]PODEŠAVANJA-NE BRISATI'!$E$13=16),UPPER(IF(K68=\"\",\"\",VLOOKUP(K68,[1]sema!$BA$430:$BK$444,8))),IF(AND(O68=\"zd\",'[1]PODEŠAVANJA-NE BRISATI'!$E$14=16),UPPER(IF(K68=\"\",\"\",VLOOKUP(K68,[1]sema!$BA$445:$BK$459,8))),\"\"))))))))))))))))))))))))","v":""}]
[null,null,null,null,null,null,null,null,null,null,{"$f":"IF(AND(O68=\"m\",'[1]PODEŠAVANJA-NE BRISATI'!$D$13=8),UPPER(IF(K68=\"\",\"\",VLOOKUP(K68,[1]sema!$BA$7:$BI$13,4))),IF(AND(O68=\"z\",'[1]PODEŠAVANJA-NE BRISATI'!$D$14=8),UPPER(IF(K68=\"\",\"\",VLOOKUP(K68,[1]sema!$BA$14:$BI$20,4))),IF(AND(O68=\"m\",'[1]PODEŠAVANJA-NE BRISATI'!$D$13=16),UPPER(IF(K68=\"\",\"\",VLOOKUP(K68,[1]sema!$BA$22:$BI$36,4))),IF(AND(O68=\"z\",'[1]PODEŠAVANJA-NE BRISATI'!$D$14=16),UPPER(IF(K68=\"\",\"\",VLOOKUP(K68,[1]sema!$BA$37:$BI$51,4))),IF(AND(O68=\"m\",'[1]PODEŠAVANJA-NE BRISATI'!$D$13=32),UPPER(IF(K68=\"\",\"\",VLOOKUP(K68,[1]sema!$BA$53:$BI$83,4))),IF(AND(O68=\"z\",'[1]PODEŠAVANJA-NE BRISATI'!$D$14=32),UPPER(IF(K68=\"\",\"\",VLOOKUP(K68,[1]sema!$BA$84:$BI$114,4))),IF(AND(O68=\"m\",'[1]PODEŠAVANJA-NE BRISATI'!$D$13=64),UPPER(IF(K68=\"\",\"\",VLOOKUP(K68,[1]sema!$BA$116:$BI$178,4))),IF(AND(O68=\"z\",'[1]PODEŠAVANJA-NE BRISATI'!$D$14=64),UPPER(IF(K68=\"\",\"\",VLOOKUP(K68,[1]sema!$BA$179:$BI$241,4))),IF(AND(O68=\"mq\",'[1]PODEŠAVANJA-NE BRISATI'!$F$13=\"8>4\"),UPPER(IF(K68=\"\",\"\",VLOOKUP(K68,[1]sema!$BA$245:$BI$248,4))),IF(AND(O68=\"mq\",'[1]PODEŠAVANJA-NE BRISATI'!$F$13=\"16>4\"),UPPER(IF(K68=\"\",\"\",VLOOKUP(K68,[1]sema!$BA$254:$BI$265,4))),IF(AND(O68=\"mq\",'[1]PODEŠAVANJA-NE BRISATI'!$F$13=\"16>8\"),UPPER(IF(K68=\"\",\"\",VLOOKUP(K68,[1]sema!$BA$280:$BI$287,4))),IF(AND(O68=\"mq\",'[1]PODEŠAVANJA-NE BRISATI'!$F$13=\"32>4\"),UPPER(IF(K68=\"\",\"\",VLOOKUP(K68,[1]sema!$BA$298:$BI$325,4))),IF(AND(O68=\"mq\",'[1]PODEŠAVANJA-NE BRISATI'!$F$13=\"32>8\"),UPPER(IF(K68=\"\",\"\",VLOOKUP(K68,[1]sema!$BA$356:$BI$379,4))),IF(AND(O68=\"zq\",'[1]PODEŠAVANJA-NE BRISATI'!$F$14=\"8>4\"),UPPER(IF(K68=\"\",\"\",VLOOKUP(K68,[1]sema!$BA$249:$BI$252,4))),IF(AND(O68=\"zq\",'[1]PODEŠAVANJA-NE BRISATI'!$F$14=\"16>4\"),UPPER(IF(K68=\"\",\"\",VLOOKUP(K68,[1]sema!$BA$266:$BI$277,4))),IF(AND(O68=\"zq\",'[1]PODEŠAVANJA-NE BRISATI'!$F$14=\"16>8\"),UPPER(IF(K68=\"\",\"\",VLOOKUP(K68,[1]sema!$BA$288:$BI$295,4))),IF(AND(O68=\"zq\",'[1]PODEŠAVANJA-NE BRISATI'!$F$14=\"32>4\"),UPPER(IF(K68=\"\",\"\",VLOOKUP(K68,[1]sema!$BA$326:$BI$353,4))),IF(AND(O68=\"zq\",'[1]PODEŠAVANJA-NE BRISATI'!$F$14=\"32>8\"),UPPER(IF(K68=\"\",\"\",VLOOKUP(K68,[1]sema!$BA$380:$BI$403,4))),IF(AND(O68=\"md\",'[1]PODEŠAVANJA-NE BRISATI'!$E$13=4),UPPER(IF(K68=\"\",\"\",VLOOKUP(K68,[1]sema!$BA$406:$BK$408,9))),IF(AND(O68=\"zd\",'[1]PODEŠAVANJA-NE BRISATI'!$E$14=4),UPPER(IF(K68=\"\",\"\",VLOOKUP(K68,[1]sema!$BA$409:$BK$411,9))),IF(AND(O68=\"md\",'[1]PODEŠAVANJA-NE BRISATI'!$E$13=8),UPPER(IF(K68=\"\",\"\",VLOOKUP(K68,[1]sema!$BA$414:$BK$420,9))),IF(AND(O68=\"zd\",'[1]PODEŠAVANJA-NE BRISATI'!$E$14=8),UPPER(IF(K68=\"\",\"\",VLOOKUP(K68,[1]sema!$BA$421:$BK$427,9))),IF(AND(O68=\"md\",'[1]PODEŠAVANJA-NE BRISATI'!$E$13=16),UPPER(IF(K68=\"\",\"\",VLOOKUP(K68,[1]sema!$BA$430:$BK$444,9))),IF(AND(O68=\"zd\",'[1]PODEŠAVANJA-NE BRISATI'!$E$14=16),UPPER(IF(K68=\"\",\"\",VLOOKUP(K68,[1]sema!$BA$445:$BK$459,9))),\"\"))))))))))))))))))))))))","v":""}]
[null,null,null,null,null,null,"vs.",null,null,{"$f":"MID(F68,3,2)","v":""},null,"vs.",null,null,{"$f":"MID(K68,3,2)","v":""}]
[null,null,null,null,null,null,null,null,null,null,{"$f":"IF(AND(O68=\"m\",'[1]PODEŠAVANJA-NE BRISATI'!$D$13=8),UPPER(IF(K68=\"\",\"\",VLOOKUP(K68,[1]sema!$BA$7:$BI$13,7))),IF(AND(O68=\"z\",'[1]PODEŠAVANJA-NE BRISATI'!$D$14=8),UPPER(IF(K68=\"\",\"\",VLOOKUP(K68,[1]sema!$BA$14:$BI$20,7))),IF(AND(O68=\"m\",'[1]PODEŠAVANJA-NE BRISATI'!$D$13=16),UPPER(IF(K68=\"\",\"\",VLOOKUP(K68,[1]sema!$BA$22:$BI$36,7))),IF(AND(O68=\"z\",'[1]PODEŠAVANJA-NE BRISATI'!$D$14=16),UPPER(IF(K68=\"\",\"\",VLOOKUP(K68,[1]sema!$BA$37:$BI$51,7))),IF(AND(O68=\"m\",'[1]PODEŠAVANJA-NE BRISATI'!$D$13=32),UPPER(IF(K68=\"\",\"\",VLOOKUP(K68,[1]sema!$BA$53:$BI$83,7))),IF(AND(O68=\"z\",'[1]PODEŠAVANJA-NE BRISATI'!$D$14=32),UPPER(IF(K68=\"\",\"\",VLOOKUP(K68,[1]sema!$BA$84:$BI$114,7))),IF(AND(O68=\"m\",'[1]PODEŠAVANJA-NE BRISATI'!$D$13=64),UPPER(IF(K68=\"\",\"\",VLOOKUP(K68,[1]sema!$BA$116:$BI$178,7))),IF(AND(O68=\"z\",'[1]PODEŠAVANJA-NE BRISATI'!$D$14=64),UPPER(IF(K68=\"\",\"\",VLOOKUP(K68,[1]sema!$BA$179:$BI$241,7))),IF(AND(O68=\"mq\",'[1]PODEŠAVANJA-NE BRISATI'!$F$13=\"8>4\"),UPPER(IF(K68=\"\",\"\",VLOOKUP(K68,[1]sema!$BA$245:$BI$248,7))),IF(AND(O68=\"mq\",'[1]PODEŠAVANJA-NE BRISATI'!$F$13=\"16>4\"),UPPER(IF(K68=\"\",\"\",VLOOKUP(K68,[1]sema!$BA$254:$BI$265,7))),IF(AND(O68=\"mq\",'[1]PODEŠAVANJA-NE BRISATI'!$F$13=\"16>8\"),UPPER(IF(K68=\"\",\"\",VLOOKUP(K68,[1]sema!$BA$280:$BI$287,7))),IF(AND(O68=\"mq\",'[1]PODEŠAVANJA-NE BRISATI'!$F$13=\"32>4\"),UPPER(IF(K68=\"\",\"\",VLOOKUP(K68,[1]sema!$BA$298:$BI$325,7))),IF(AND(O68=\"mq\",'[1]PODEŠAVANJA-NE BRISATI'!$F$13=\"32>8\"),UPPER(IF(K68=\"\",\"\",VLOOKUP(K68,[1]sema!$BA$356:$BI$379,7))),IF(AND(O68=\"zq\",'[1]PODEŠAVANJA-NE BRISATI'!$F$14=\"8>4\"),UPPER(IF(K68=\"\",\"\",VLOOKUP(K68,[1]sema!$BA$249:$BI$252,7))),IF(AND(O68=\"zq\",'[1]PODEŠAVANJA-NE BRISATI'!$F$14=\"16>4\"),UPPER(IF(K68=\"\",\"\",VLOOKUP(K68,[1]sema!$BA$266:$BI$277,7))),IF(AND(O68=\"zq\",'[1]PODEŠAVANJA-NE BRISATI'!$F$14=\"16>8\"),UPPER(IF(K68=\"\",\"\",VLOOKUP(K68,[1]sema!$BA$288:$BI$295,7))),IF(AND(O68=\"zq\",'[1]PODEŠAVANJA-NE BRISATI'!$F$14=\"32>4\"),UPPER(IF(K68=\"\",\"\",VLOOKUP(K68,[1]sema!$BA$326:$BI$353,7))),IF(AND(O68=\"zq\",'[1]PODEŠAVANJA-NE BRISATI'!$F$14=\"32>8\"),UPPER(IF(K68=\"\",\"\",VLOOKUP(K68,[1]sema!$BA$380:$BI$403,7))),IF(AND(O68=\"md\",'[1]PODEŠAVANJA-NE BRISATI'!$E$13=4),UPPER(IF(K68=\"\",\"\",VLOOKUP(K68,[1]sema!$BA$406:$BK$408,10))),IF(AND(O68=\"zd\",'[1]PODEŠAVANJA-NE BRISATI'!$E$14=4),UPPER(IF(K68=\"\",\"\",VLOOKUP(K68,[1]sema!$BA$409:$BK$411,10))),IF(AND(O68=\"md\",'[1]PODEŠAVANJA-NE BRISATI'!$E$13=8),UPPER(IF(K68=\"\",\"\",VLOOKUP(K68,[1]sema!$BA$414:$BK$420,10))),IF(AND(O68=\"zd\",'[1]PODEŠAVANJA-NE BRISATI'!$E$14=8),UPPER(IF(K68=\"\",\"\",VLOOKUP(K68,[1]sema!$BA$421:$BK$427,10))),IF(AND(O68=\"md\",'[1]PODEŠAVANJA-NE BRISATI'!$E$13=16),UPPER(IF(K68=\"\",\"\",VLOOKUP(K68,[1]sema!$BA$430:$BK$444,10))),IF(AND(O68=\"zd\",'[1]PODEŠAVANJA-NE BRISATI'!$E$14=16),UPPER(IF(K68=\"\",\"\",VLOOKUP(K68,[1]sema!$BA$445:$BK$459,10))),\"\"))))))))))))))))))))))))","v":""}]
[null,null,null,null,null,{"$f":"IF(AND(J68=\"m\",'[1]PODEŠAVANJA-NE BRISATI'!$D$13=8),UPPER(IF(F68=\"\",\"\",VLOOKUP(F68,[1]sema!$BA$7:$BI$13,9))),IF(AND(J68=\"z\",'[1]PODEŠAVANJA-NE BRISATI'!$D$14=8),UPPER(IF(F68=\"\",\"\",VLOOKUP(F68,[1]sema!$BA$14:$BI$20,9))),IF(AND(J68=\"m\",'[1]PODEŠAVANJA-NE BRISATI'!$D$13=16),UPPER(IF(F68=\"\",\"\",VLOOKUP(F68,[1]sema!$BA$22:$BI$36,9))),IF(AND(J68=\"z\",'[1]PODEŠAVANJA-NE BRISATI'!$D$14=16),UPPER(IF(F68=\"\",\"\",VLOOKUP(F68,[1]sema!$BA$37:$BI$51,9))),IF(AND(J68=\"m\",'[1]PODEŠAVANJA-NE BRISATI'!$D$13=32),UPPER(IF(F68=\"\",\"\",VLOOKUP(F68,[1]sema!$BA$53:$BI$83,9))),IF(AND(J68=\"z\",'[1]PODEŠAVANJA-NE BRISATI'!$D$14=32),UPPER(IF(F68=\"\",\"\",VLOOKUP(F68,[1]sema!$BA$84:$BI$114,9))),IF(AND(J68=\"m\",'[1]PODEŠAVANJA-NE BRISATI'!$D$13=64),UPPER(IF(F68=\"\",\"\",VLOOKUP(F68,[1]sema!$BA$116:$BI$178,9))),IF(AND(J68=\"z\",'[1]PODEŠAVANJA-NE BRISATI'!$D$14=64),UPPER(IF(F68=\"\",\"\",VLOOKUP(F68,[1]sema!$BA$179:$BI$241,9))),IF(AND(J68=\"mq\",'[1]PODEŠAVANJA-NE BRISATI'!$F$13=\"8>4\"),UPPER(IF(F68=\"\",\"\",VLOOKUP(F68,[1]sema!$BA$245:$BI$248,9))),IF(AND(J68=\"mq\",'[1]PODEŠAVANJA-NE BRISATI'!$F$13=\"16>4\"),UPPER(IF(F68=\"\",\"\",VLOOKUP(F68,[1]sema!$BA$254:$BI$265,9))),IF(AND(J68=\"mq\",'[1]PODEŠAVANJA-NE BRISATI'!$F$13=\"16>8\"),UPPER(IF(F68=\"\",\"\",VLOOKUP(F68,[1]sema!$BA$280:$BI$287,9))),IF(AND(J68=\"mq\",'[1]PODEŠAVANJA-NE BRISATI'!$F$13=\"32>4\"),UPPER(IF(F68=\"\",\"\",VLOOKUP(F68,[1]sema!$BA$298:$BI$325,9))),IF(AND(J68=\"mq\",'[1]PODEŠAVANJA-NE BRISATI'!$F$13=\"32>8\"),UPPER(IF(F68=\"\",\"\",VLOOKUP(F68,[1]sema!$BA$356:$BI$379,9))),IF(AND(J68=\"zq\",'[1]PODEŠAVANJA-NE BRISATI'!$F$14=\"8>4\"),UPPER(IF(F68=\"\",\"\",VLOOKUP(F68,[1]sema!$BA$249:$BI$252,9))),IF(AND(J68=\"zq\",'[1]PODEŠAVANJA-NE BRISATI'!$F$14=\"16>4\"),UPPER(IF(F68=\"\",\"\",VLOOKUP(F68,[1]sema!$BA$266:$BI$277,9))),IF(AND(J68=\"zq\",'[1]PODEŠAVANJA-NE BRISATI'!$F$14=\"16>8\"),UPPER(IF(F68=\"\",\"\",VLOOKUP(F68,[1]sema!$BA$288:$BI$295,9))),IF(AND(J68=\"zq\",'[1]PODEŠAVANJA-NE BRISATI'!$F$14=\"32>4\"),UPPER(IF(F68=\"\",\"\",VLOOKUP(F68,[1]sema!$BA$326:$BI$353,9))),IF(AND(J68=\"zq\",'[1]PODEŠAVANJA-NE BRISATI'!$F$14=\"32>8\"),UPPER(IF(F68=\"\",\"\",VLOOKUP(F68,[1]sema!$BA$380:$BI$403,9))),IF(AND(J68=\"md\",'[1]PODEŠAVANJA-NE BRISATI'!$E$13=4),UPPER(IF(F68=\"\",\"\",VLOOKUP(F68,[1]sema!$BA$406:$BK$408,11))),IF(AND(J68=\"zd\",'[1]PODEŠAVANJA-NE BRISATI'!$E$14=4),UPPER(IF(F68=\"\",\"\",VLOOKUP(F68,[1]sema!$BA$409:$BK$411,11))),IF(AND(J68=\"md\",'[1]PODEŠAVANJA-NE BRISATI'!$E$13=8),UPPER(IF(F68=\"\",\"\",VLOOKUP(F68,[1]sema!$BA$414:$BK$420,11))),IF(AND(J68=\"zd\",'[1]PODEŠAVANJA-NE BRISATI'!$E$14=8),UPPER(IF(F68=\"\",\"\",VLOOKUP(F68,[1]sema!$BA$421:$BK$427,11))),IF(AND(J68=\"md\",'[1]PODEŠAVANJA-NE BRISATI'!$E$13=16),UPPER(IF(F68=\"\",\"\",VLOOKUP(F68,[1]sema!$BA$430:$BK$444,11))),IF(AND(J68=\"zd\",'[1]PODEŠAVANJA-NE BRISATI'!$E$14=16),UPPER(IF(F68=\"\",\"\",VLOOKUP(F68,[1]sema!$BA$445:$BK$459,11))),\"\"))))))))))))))))))))))))","v":""},null,null,null,null,{"$f":"IF(AND(O68=\"m\",'[1]PODEŠAVANJA-NE BRISATI'!$D$13=8),UPPER(IF(K68=\"\",\"\",VLOOKUP(K68,[1]sema!$BA$7:$BI$13,9))),IF(AND(O68=\"z\",'[1]PODEŠAVANJA-NE BRISATI'!$D$14=8),UPPER(IF(K68=\"\",\"\",VLOOKUP(K68,[1]sema!$BA$14:$BI$20,9))),IF(AND(O68=\"m\",'[1]PODEŠAVANJA-NE BRISATI'!$D$13=16),UPPER(IF(K68=\"\",\"\",VLOOKUP(K68,[1]sema!$BA$22:$BI$36,9))),IF(AND(O68=\"z\",'[1]PODEŠAVANJA-NE BRISATI'!$D$14=16),UPPER(IF(K68=\"\",\"\",VLOOKUP(K68,[1]sema!$BA$37:$BI$51,9))),IF(AND(O68=\"m\",'[1]PODEŠAVANJA-NE BRISATI'!$D$13=32),UPPER(IF(K68=\"\",\"\",VLOOKUP(K68,[1]sema!$BA$53:$BI$83,9))),IF(AND(O68=\"z\",'[1]PODEŠAVANJA-NE BRISATI'!$D$14=32),UPPER(IF(K68=\"\",\"\",VLOOKUP(K68,[1]sema!$BA$84:$BI$114,9))),IF(AND(O68=\"m\",'[1]PODEŠAVANJA-NE BRISATI'!$D$13=64),UPPER(IF(K68=\"\",\"\",VLOOKUP(K68,[1]sema!$BA$116:$BI$178,9))),IF(AND(O68=\"z\",'[1]PODEŠAVANJA-NE BRISATI'!$D$14=64),UPPER(IF(K68=\"\",\"\",VLOOKUP(K68,[1]sema!$BA$179:$BI$241,9))),IF(AND(O68=\"mq\",'[1]PODEŠAVANJA-NE BRISATI'!$F$13=\"8>4\"),UPPER(IF(K68=\"\",\"\",VLOOKUP(K68,[1]sema!$BA$245:$BI$248,9))),IF(AND(O68=\"mq\",'[1]PODEŠAVANJA-NE BRISATI'!$F$13=\"16>4\"),UPPER(IF(K68=\"\",\"\",VLOOKUP(K68,[1]sema!$BA$254:$BI$265,9))),IF(AND(O68=\"mq\",'[1]PODEŠAVANJA-NE BRISATI'!$F$13=\"16>8\"),UPPER(IF(K68=\"\",\"\",VLOOKUP(K68,[1]sema!$BA$280:$BI$287,9))),IF(AND(O68=\"mq\",'[1]PODEŠAVANJA-NE BRISATI'!$F$13=\"32>4\"),UPPER(IF(K68=\"\",\"\",VLOOKUP(K68,[1]sema!$BA$298:$BI$325,9))),IF(AND(O68=\"mq\",'[1]PODEŠAVANJA-NE BRISATI'!$F$13=\"32>8\"),UPPER(IF(K68=\"\",\"\",VLOOKUP(K68,[1]sema!$BA$356:$BI$379,9))),IF(AND(O68=\"zq\",'[1]PODEŠAVANJA-NE BRISATI'!$F$14=\"8>4\"),UPPER(IF(K68=\"\",\"\",VLOOKUP(K68,[1]sema!$BA$249:$BI$252,9))),IF(AND(O68=\"zq\",'[1]PODEŠAVANJA-NE BRISATI'!$F$14=\"16>4\"),UPPER(IF(K68=\"\",\"\",VLOOKUP(K68,[1]sema!$BA$266:$BI$277,9))),IF(AND(O68=\"zq\",'[1]PODEŠAVANJA-NE BRISATI'!$F$14=\"16>8\"),UPPER(IF(K68=\"\",\"\",VLOOKUP(K68,[1]sema!$BA$288:$BI$295,9))),IF(AND(O68=\"zq\",'[1]PODEŠAVANJA-NE BRISATI'!$F$14=\"32>4\"),UPPER(IF(K68=\"\",\"\",VLOOKUP(K68,[1]sema!$BA$326:$BI$353,9))),IF(AND(O68=\"zq\",'[1]PODEŠAVANJA-NE BRISATI'!$F$14=\"32>8\"),UPPER(IF(K68=\"\",\"\",VLOOKUP(K68,[1]sema!$BA$380:$BI$403,9))),IF(AND(O68=\"md\",'[1]PODEŠAVANJA-NE BRISATI'!$E$13=4),UPPER(IF(K68=\"\",\"\",VLOOKUP(K68,[1]sema!$BA$406:$BK$408,11))),IF(AND(O68=\"zd\",'[1]PODEŠAVANJA-NE BRISATI'!$E$14=4),UPPER(IF(K68=\"\",\"\",VLOOKUP(K68,[1]sema!$BA$409:$BK$411,11))),IF(AND(O68=\"md\",'[1]PODEŠAVANJA-NE BRISATI'!$E$13=8),UPPER(IF(K68=\"\",\"\",VLOOKUP(K68,[1]sema!$BA$414:$BK$420,11))),IF(AND(O68=\"zd\",'[1]PODEŠAVANJA-NE BRISATI'!$E$14=8),UPPER(IF(K68=\"\",\"\",VLOOKUP(K68,[1]sema!$BA$421:$BK$427,11))),IF(AND(O68=\"md\",'[1]PODEŠAVANJA-NE BRISATI'!$E$13=16),UPPER(IF(K68=\"\",\"\",VLOOKUP(K68,[1]sema!$BA$430:$BK$444,11))),IF(AND(O68=\"zd\",'[1]PODEŠAVANJA-NE BRISATI'!$E$14=16),UPPER(IF(K68=\"\",\"\",VLOOKUP(K68,[1]sema!$BA$445:$BK$459,11))),\"\"))))))))))))))))))))))))","v":""}]
[]
[null,null,null,null,"POSLEDNJI MEC NA SVAKOM TERENU MOZE BITI PREMESTEN",null,null,null,null,null,"VREME OBJAVE",null,"POTPIS"]
[null,null,null,null,"Upis ALT do:",null,null,null,null,null,null,null,{"$f":"O6","v":0}]
[]
[]
[]
[]
[]
[]
[]
[]
[]
[]
[]
[]
[]
[]
[]
[]
[]
[]
[]
[]
[]
[]
[]
[]
[]
[]
[]
[]
[]
[]
[]
[]
[]
[]
[]
[]
[]
[]
[]
[]
[]
[]
[]
[]
[]
[]
[]
[]
[]
[]
[]
[]
[]
[]
[]
[]
[]
[]
[]
[]
[]
[]
[]
[]
[]
[]
[]
[]
[]
[]
[]
[]
[]
[]
[]
[]
[]
[]
[]
[]
[]
[]
[]
[]
[]
[]
[]
[]
[]
[]
[]
[]
[]
[]
[]
[]
[]
[]
[]
[]
[]
[]
[]
[]
[]
[]
[]
[]
[]
[]
[]
[]
[]
[]
[]
[]
[]
[]
[]
[]
[]
[]
[]
[]
[]
[]
[]
[]
[]
[]
[]
[]
[]
[]
[]
[]
[]
[]
[]
[]
[]
[]
[]
[]
[]
[]
[]
[]
[]
[]
[]
[]
[]
[]
[]
[]
[]
[]
[]
[]
[]
[]
[]
[]
[]
[]
[]
[]
[]
[]
[]
[]
[]
[]
[]
[]
[]
[]
[]
[]
[]
[]
[]
[]
[]
[]
[]
[]
[]
[]
[]
[]
[]
[]
[]
[]
[]
[]
[]
[]
[]
[]
[]
[]
[]
[]
[]
[]
[]
[]
[]
[]
[]
[]
[]
[]
[]
[]
[]
[]
[]
[]
[]
[]
[]
[]
[]
[]
[]
[]
[]
[]
[]
[]
[]
[]
[]
[]
[]
[]
[]
[]
[]
[]
[]
[]
[]
[]
[]
[]
[]
[]
[]
[]
[]
[]
[]
[]
[]
[]
[]
[]
[]
[]
[]
[]
[]
[]
[]
[]
[]
[]
[]
[]
[]
[]
[]
[]
[]
[]
[]
[]
[]
[]
[]
[]
[]
[]
[]
[]
[]
[]
[]
[]
[]
[]
[]
[]
[]
[]
[]
[]
[]
[]
[]
[]
[]
[]
[]
[]
[]
[]
[]
[]
[]
[]
[]
[]
[]
[]
[]
[]
[]
[]
[]
[]
[]
[]
[]
[]
[]
[]
[]
[]
[]
[]
[]
[]
[]
[]
[]
[]
[]
[]
[]
[]
[]
[null,null,null,null,null,null,null,null,null,null,null,null,null,null,null,null,null,{"$f":"#REF!","v":{"$error":"#REF!"}},{"$f":"Z421","v":" "},"01md",{"$f":"'[1]DECACI DUBL 4'!E8","v":""},{"$f":"'[1]DECACI DUBL 4'!F8","v":""},{"$f":"CONCATENATE($U421,\" \",$V421,\" \",\"(\",'[1]DECACI DUBL 4'!$D$7,\")\")","v":"  (0)"},{"$f":"'[1]DECACI DUBL 4'!E12","v":""},{"$f":"'[1]DECACI DUBL 4'!F12","v":""},{"$f":"CONCATENATE($X421,\" \",$Y421)","v":" "}]
[null,null,null,null,null,null,null,null,null,null,null,null,null,null,null,null,null,{"$f":"#REF!","v":{"$error":"#REF!"}},{"$f":"Z422","v":"  (0)"},"02md",{"$f":"'[1]DECACI DUBL 4'!E16","v":""},{"$f":"'[1]DECACI DUBL 4'!F16","v":""},{"$f":"CONCATENATE($U422,\" \",$V422)","v":" "},{"$f":"'[1]DECACI DUBL 4'!E20","v":""},{"$f":"'[1]DECACI DUBL 4'!F20","v":""},{"$f":"CONCATENATE($X422,\" \",$Y422,\" \",\"(\",'[1]DECACI DUBL 4'!$D$19,\")\")","v":"  (0)"}]
[null,null,null,null,null,null,null,null,null,null,null,null,null,null,null,null,null,{"$f":"IF(ISBLANK('[1]DECACI DUBL 4'!$I$18),CONCATENATE(#REF!,\"/\",U422,\" ili\"),IF(OR('[1]DECACI DUBL 4'!$I$18=\"a\",'[1]DECACI DUBL 4'!$I$18=\"as\"),#REF!,#REF!))","v":{"$error":"#REF!"}},{"$f":"IF(ISBLANK('[1]DECACI DUBL 4'!$I$18),CONCATENATE(#REF!,\"/\",X422,\" (2)\"),IF(OR('[1]DECACI DUBL 4'!$I$18=\"b\",'[1]DECACI DUBL 4'!$I$18=\"bs\"),Z422,W422))","v":" "},"03md",{"$f":"'[1]DECACI DUBL 4'!J10","v":""},null,{"$f":"IF(ISBLANK('[1]DECACI DUBL 4'!$I$10),$Z421,IF($U423=$U421,$W421,IF($U423=$X421,$Z421,\"\")))","v":"  (0)"},{"$f":"'[1]DECACI DUBL 4'!J18","v":""},null,{"$f":"IF(ISBLANK('[1]DECACI DUBL 4'!$I$18),$W422,IF($X423=$U422,$W422,IF($X423=$X422,$Z422,\"\")))","v":" "}]
[null,null,null,null,null,null,null,null,null,null,null,null,null,null,null,null,null,{"$f":"#REF!","v":{"$error":"#REF!"}},{"$f":"Z424","v":{"$error":"#REF!"}},"01zd",{"$f":"#REF!","v":{"$error":"#REF!"}},{"$f":"#REF!","v":{"$error":"#REF!"}},{"$f":"CONCATENATE($U424,\" \",$V424,\" \",\"(\",#REF!,\")\")","v":{"$error":"#REF!"}},{"$f":"#REF!","v":{"$error":"#REF!"}},{"$f":"#REF!","v":{"$error":"#REF!"}},{"$f":"CONCATENATE($X424,\" \",$Y424)","v":{"$error":"#REF!"}}]
[null,null,null,null,null,null,null,null,null,null,null,null,null,null,null,null,null,{"$f":"#REF!","v":{"$error":"#REF!"}},{"$f":"Z425","v":{"$error":"#REF!"}},"02zd",{"$f":"#REF!","v":{"$error":"#REF!"}},{"$f":"#REF!","v":{"$error":"#REF!"}},{"$f":"CONCATENATE($U425,\" \",$V425)","v":{"$error":"#REF!"}},{"$f":"#REF!","v":{"$error":"#REF!"}},{"$f":"#REF!","v":{"$error":"#REF!"}},{"$f":"CONCATENATE($X425,\" \",$Y425,\" \",\"(\",#REF!,\")\")","v":{"$error":"#REF!"}}]
[null,null,null,null,null,null,null,null,null,null,null,null,null,null,null,null,null,{"$f":"IF(ISBLANK(#REF!),CONCATENATE(#REF!,\"/\",U425,\" ili\"),IF(OR(#REF!=\"a\",#REF!=\"as\"),#REF!,#REF!))","v":{"$error":"#REF!"}},{"$f":"IF(ISBLANK(#REF!),CONCATENATE(#REF!,\"/\",X425,\" (2)\"),IF(OR(#REF!=\"b\",#REF!=\"bs\"),Z425,W425))","v":{"$error":"#REF!"}},"03zd",{"$f":"#REF!","v":{"$error":"#REF!"}},null,{"$f":"IF(ISBLANK(#REF!),$Z424,IF($U426=$U424,$W424,IF($U426=$X424,$Z424,\"\")))","v":{"$error":"#REF!"}},{"$f":"#REF!","v":{"$error":"#REF!"}},null,{"$f":"IF(ISBLANK(#REF!),$W425,IF($X426=$U425,$W425,IF($X426=$X425,$Z425,\"\")))","v":{"$error":"#REF!"}}]
[]
[]
[null,null,null,null,null,null,null,null,null,null,null,null,null,null,null,null,null,{"$f":"#REF!","v":{"$error":"#REF!"}},{"$f":"Z429","v":" "},"01md",{"$f":"'[1]DECACI DUBL 8'!E8","v":""},{"$f":"'[1]DECACI DUBL 8'!F8","v":""},{"$f":"CONCATENATE($U429,\" \",$V429,\" \",\"(\",'[1]DECACI DUBL 8'!$D$7,\")\")","v":"  (0)"},{"$f":"'[1]DECACI DUBL 8'!E12","v":""},{"$f":"'[1]DECACI DUBL 8'!F12","v":""},{"$f":"CONCATENATE($X429,\" \",$Y429)","v":" "}]
[null,null,null,null,null,null,null,null,null,null,null,null,null,null,null,null,null,{"$f":"#REF!","v":{"$error":"#REF!"}},{"$f":"Z430","v":" "},"02md",{"$f":"'[1]DECACI DUBL 8'!E16","v":""},{"$f":"'[1]DECACI DUBL 8'!F16","v":""},{"$f":"CONCATENATE($U430,\" \",$V430)","v":" "},{"$f":"'[1]DECACI DUBL 8'!E20","v":""},{"$f":"'[1]DECACI DUBL 8'!F20","v":""},{"$f":"CONCATENATE($X430,\" \",$Y430)","v":" "}]
[null,null,null,null,null,null,null,null,null,null,null,null,null,null,null,null,null,{"$f":"#REF!","v":{"$error":"#REF!"}},{"$f":"Z431","v":" "},"03md",{"$f":"'[1]DECACI DUBL 8'!E24","v":""},{"$f":"'[1]DECACI DUBL 8'!F24","v":""},{"$f":"CONCATENATE($U431,\" \",$V431)","v":" "},{"$f":"'[1]DECACI DUBL 8'!E28","v":""},{"$f":"'[1]DECACI DUBL 8'!F28","v":""},{"$f":"CONCATENATE($X431,\" \",$Y431)","v":" "}]
[null,null,null,null,null,null,null,null,null,null,null,null,null,null,null,null,null,{"$f":"#REF!","v":{"$error":"#REF!"}},{"$f":"Z432","v":"  (0)"},"04md",{"$f":"'[1]DECACI DUBL 8'!E32","v":""},{"$f":"'[1]DECACI DUBL 8'!F32","v":""},{"$f":"CONCATENATE($U432,\" \",$V432)","v":" "},{"$f":"'[1]DECACI DUBL 8'!E36","v":""},{"$f":"'[1]DECACI DUBL 8'!F36","v":""},{"$f":"CONCATENATE($X432,\" \",$Y432,\" \",\"(\",'[1]DECACI DUBL 8'!$D$35,\")\")","v":"  (0)"}]
[null,null,null,null,null,null,null,null,null,null,null,null,null,null,null,null,null,{"$f":"IF(ISBLANK('[1]DECACI DUBL 8'!$I$18),CONCATENATE(#REF!,\"/\",U430,\" ili\"),IF(OR('[1]DECACI DUBL 8'!$I$18=\"a\",'[1]DECACI DUBL 4'!$I$18=\"as\"),#REF!,#REF!))","v":{"$error":"#REF!"}},{"$f":"IF(ISBLANK('[1]DECACI DUBL 8'!$I$18),CONCATENATE(#REF!,\"/\",X430,),IF(OR('[1]DECACI DUBL 8'!$I$18=\"b\",'[1]DECACI DUBL 8'!$I$18=\"bs\"),Z430,W430))","v":" "},"05md",{"$f":"'[1]DECACI DUBL 8'!J10","v":""},null,{"$f":"IF(ISBLANK('[1]DECACI DUBL 8'!$I$10),$Z429,IF($U433=$U429,$W429,IF($U433=$X429,$Z429,\"\")))","v":"  (0)"},{"$f":"'[1]DECACI DUBL 8'!J18","v":""},null,{"$f":"IF(ISBLANK('[1]DECACI DUBL 8'!$I$18),$W430,IF($X433=$U430,$W430,IF($X433=$X430,$Z430,\"\")))","v":" "}]
[null,null,null,null,null,null,null,null,null,null,null,null,null,null,null,null,null,{"$f":"IF(ISBLANK('[1]DECACI DUBL 8'!$I$34),CONCATENATE(#REF!,\"/\",U432,\" ili\"),IF(OR('[1]DECACI DUBL 8'!$I$34=\"a\",'[1]DECACI DUBL 4'!$I$34=\"as\"),#REF!,#REF!))","v":{"$error":"#REF!"}},{"$f":"IF(ISBLANK('[1]DECACI DUBL 8'!$I$34),CONCATENATE(#REF!,\"/\",X432,\" (2)\"),IF(OR('[1]DECACI DUBL 8'!$I$34=\"b\",'[1]DECACI DUBL 8'!$I$34=\"bs\"),Z432,W432))","v":" "},"06md",{"$f":"'[1]DECACI DUBL 8'!J26","v":""},null,{"$f":"IF(ISBLANK('[1]DECACI DUBL 8'!$I$26),$Z431,IF($U434=$U431,$W431,IF($U434=$X431,$Z431,\"\")))","v":" "},{"$f":"'[1]DECACI DUBL 8'!J34","v":""},null,{"$f":"IF(ISBLANK('[1]DECACI DUBL 8'!$I$34),$W432,IF($X434=$U432,$W432,IF($X434=$X432,$Z432,\"\")))","v":" "}]
[null,null,null,null,null,null,null,null,null,null,null,null,null,null,null,null,null,{"$f":"IF(ISBLANK('[1]DECACI DUBL 8'!$K$30),CONCATENATE(#REF!,\"/\",U434,\" ili\"),IF(OR('[1]DECACI DUBL 8'!$K$30=\"a\",'[1]DECACI DUBL 4'!$K$30=\"as\"),#REF!,#REF!))","v":{"$error":"#REF!"}},{"$f":"IF(ISBLANK('[1]DECACI DUBL 8'!$K$30),CONCATENATE(#REF!,\"/\",X434,AF435),IF(OR('[1]DECACI DUBL 8'!$K$30=\"b\",'[1]DECACI DUBL 8'!$K$30=\"bs\"),Z434,W434))","v":" "},"07md",{"$f":"'[1]DECACI DUBL 8'!L14","v":""},null,{"$f":"IF(ISBLANK('[1]DECACI DUBL 8'!$K$14),$Z433,IF($U435=$U433,$W433,IF($U435=$X433,$Z433,\"\")))","v":"  (0)"},{"$f":"'[1]DECACI DUBL 8'!L30","v":""},null,{"$f":"IF(ISBLANK('[1]DECACI DUBL 8'!$K$30),$W434,IF($X435=$U434,$W434,IF($X435=$X434,$Z434,\"\")))","v":" "},null,null,{"$f":"IF('[1]DECACI DUBL 8'!$I$10=\"as\",CONCATENATE(\" (\",'[1]DECACI DUBL 8'!$D$7,\")\"),\"\")","v":""},null,null,{"$f":"IF('[1]DECACI DUBL 8'!$I$34=\"bs\",CONCATENATE(\" (\",'[1]DECACI DUBL 8'!$D$35,\")\"),\"\")","v":""}]
[null,null,null,null,null,null,null,null,null,null,null,null,null,null,null,null,null,{"$f":"#REF!","v":{"$error":"#REF!"}},{"$f":"Z436","v":{"$error":"#REF!"}},"01zd",{"$f":"#REF!","v":{"$error":"#REF!"}},{"$f":"#REF!","v":{"$error":"#REF!"}},{"$f":"CONCATENATE($U436,\" \",$V436,\" \",\"(\",#REF!,\")\")","v":{"$error":"#REF!"}},{"$f":"#REF!","v":{"$error":"#REF!"}},{"$f":"#REF!","v":{"$error":"#REF!"}},{"$f":"CONCATENATE($X436,\" \",$Y436)","v":{"$error":"#REF!"}}]
[null,null,null,null,null,null,null,null,null,null,null,null,null,null,null,null,null,{"$f":"#REF!","v":{"$error":"#REF!"}},{"$f":"Z437","v":{"$error":"#REF!"}},"02zd",{"$f":"#REF!","v":{"$error":"#REF!"}},{"$f":"#REF!","v":{"$error":"#REF!"}},{"$f":"CONCATENATE($U437,\" \",$V437)","v":{"$error":"#REF!"}},{"$f":"#REF!","v":{"$error":"#REF!"}},{"$f":"#REF!","v":{"$error":"#REF!"}},{"$f":"CONCATENATE($X437,\" \",$Y437)","v":{"$error":"#REF!"}}]
[null,null,null,null,null,null,null,null,null,null,null,null,null,null,null,null,null,{"$f":"#REF!","v":{"$error":"#REF!"}},{"$f":"Z438","v":{"$error":"#REF!"}},"03zd",{"$f":"#REF!","v":{"$error":"#REF!"}},{"$f":"#REF!","v":{"$error":"#REF!"}},{"$f":"CONCATENATE($U438,\" \",$V438)","v":{"$error":"#REF!"}},{"$f":"#REF!","v":{"$error":"#REF!"}},{"$f":"#REF!","v":{"$error":"#REF!"}},{"$f":"CONCATENATE($X438,\" \",$Y438)","v":{"$error":"#REF!"}}]
[null,null,null,null,null,null,null,null,null,null,null,null,null,null,null,null,null,{"$f":"#REF!","v":{"$error":"#REF!"}},{"$f":"Z439","v":{"$error":"#REF!"}},"04zd",{"$f":"#REF!","v":{"$error":"#REF!"}},{"$f":"#REF!","v":{"$error":"#REF!"}},{"$f":"CONCATENATE($U439,\" \",$V439)","v":{"$error":"#REF!"}},{"$f":"#REF!","v":{"$error":"#REF!"}},{"$f":"#REF!","v":{"$error":"#REF!"}},{"$f":"CONCATENATE($X439,\" \",$Y439,\" \",\"(\",#REF!,\")\")","v":{"$error":"#REF!"}}]
[null,null,null,null,null,null,null,null,null,null,null,null,null,null,null,null,null,{"$f":"IF(ISBLANK(#REF!),CONCATENATE(#REF!,\"/\",U437,\" ili\"),IF(OR(#REF!=\"a\",'[1]DECACI DUBL 4'!$I$18=\"as\"),#REF!,#REF!))","v":{"$error":"#REF!"}},{"$f":"IF(ISBLANK(#REF!),CONCATENATE(#REF!,\"/\",X437,),IF(OR(#REF!=\"b\",#REF!=\"bs\"),Z437,W437))","v":{"$error":"#REF!"}},"05zd",{"$f":"#REF!","v":{"$error":"#REF!"}},null,{"$f":"IF(ISBLANK(#REF!),$Z436,IF($U440=$U436,$W436,IF($U440=$X436,$Z436,\"\")))","v":{"$error":"#REF!"}},{"$f":"#REF!","v":{"$error":"#REF!"}},null,{"$f":"IF(ISBLANK(#REF!),$W437,IF($X440=$U437,$W437,IF($X440=$X437,$Z437,\"\")))","v":{"$error":"#REF!"}}]
[null,null,null,null,null,null,null,null,null,null,null,null,null,null,null,null,null,{"$f":"IF(ISBLANK(#REF!),CONCATENATE(#REF!,\"/\",U439,\" ili\"),IF(OR(#REF!=\"a\",'[1]DECACI DUBL 4'!$I$34=\"as\"),#REF!,#REF!))","v":{"$error":"#REF!"}},{"$f":"IF(ISBLANK(#REF!),CONCATENATE(#REF!,\"/\",X439,\" (2)\"),IF(OR(#REF!=\"b\",#REF!=\"bs\"),Z439,W439))","v":{"$error":"#REF!"}},"06zd",{"$f":"#REF!","v":{"$error":"#REF!"}},null,{"$f":"IF(ISBLANK(#REF!),$Z438,IF($U441=$U438,$W438,IF($U441=$X438,$Z438,\"\")))","v":{"$error":"#REF!"}},{"$f":"#REF!","v":{"$error":"#REF!"}},null,{"$f":"IF(ISBLANK(#REF!),$W439,IF($X441=$U439,$W439,IF($X441=$X439,$Z439,\"\")))","v":{"$error":"#REF!"}}]
[null,null,null,null,null,null,null,null,null,null,null,null,null,null,null,null,null,{"$f":"IF(ISBLANK(#REF!),CONCATENATE(#REF!,\"/\",U441,\" ili\"),IF(OR(#REF!=\"a\",'[1]DECACI DUBL 4'!$K$30=\"as\"),#REF!,#REF!))","v":{"$error":"#REF!"}},{"$f":"IF(ISBLANK(#REF!),CONCATENATE(#REF!,\"/\",X441,AF442),IF(OR(#REF!=\"b\",#REF!=\"bs\"),Z441,W441))","v":{"$error":"#REF!"}},"07zd",{"$f":"#REF!","v":{"$error":"#REF!"}},null,{"$f":"IF(ISBLANK(#REF!),$Z440,IF($U442=$U440,$W440,IF($U442=$X440,$Z440,\"\")))","v":{"$error":"#REF!"}},{"$f":"#REF!","v":{"$error":"#REF!"}},null,{"$f":"IF(ISBLANK(#REF!),$W441,IF($X442=$U441,$W441,IF($X442=$X441,$Z441,\"\")))","v":{"$error":"#REF!"}},null,null,{"$f":"IF(#REF!=\"as\",CONCATENATE(\" (\",#REF!,\")\"),\"\")","v":{"$error":"#REF!"}},null,null,{"$f":"IF(#REF!=\"bs\",CONCATENATE(\" (\",#REF!,\")\"),\"\")","v":{"$error":"#REF!"}}]
[]
[]
[null,null,null,null,null,null,null,null,null,null,null,null,null,null,null,null,null,{"$f":"#REF!","v":{"$error":"#REF!"}},{"$f":"Z445","v":" "},"01md",{"$f":"'[1]DECACI DUBL 16'!E8","v":""},{"$f":"'[1]DECACI DUBL 16'!F8","v":""},{"$f":"CONCATENATE($U445,\" \",$V445,\" \",\"(\",'[1]DECACI DUBL 16'!$D$7,\")\")","v":"  (0)"},{"$f":"'[1]DECACI DUBL 16'!E12","v":""},{"$f":"'[1]DECACI DUBL 16'!F12","v":""},{"$f":"CONCATENATE($X445,\" \",$Y445)","v":" "}]
[null,null,null,null,null,null,null,null,null,null,null,null,null,null,null,null,null,{"$f":"#REF!","v":{"$error":"#REF!"}}," ","02md",{"$f":"'[1]DECACI DUBL 16'!E16","v":""},{"$f":"'[1]DECACI DUBL 16'!F16","v":""},{"$f":"CONCATENATE($U446,\" \",$V446)","v":" "},{"$f":"'[1]DECACI DUBL 16'!E20","v":""},{"$f":"'[1]DECACI DUBL 16'!F20","v":""},{"$f":"CONCATENATE($X446,\" \",$Y446)","v":" "}]
[null,null,null,null,null,null,null,null,null,null,null,null,null,null,null,null,null,{"$f":"#REF!","v":{"$error":"#REF!"}}," ","03md",{"$f":"'[1]DECACI DUBL 16'!E24","v":""},{"$f":"'[1]DECACI DUBL 16'!F24","v":""},{"$f":"CONCATENATE($U447,\" \",$V447,\" \",\"(\",'[1]DECACI DUBL 16'!$D$23,\")\")","v":"  (0)"},{"$f":"'[1]DECACI DUBL 16'!E28","v":""},{"$f":"'[1]DECACI DUBL 16'!F28","v":""},{"$f":"CONCATENATE($X447,\" \",$Y447)","v":" "}]
[null,null,null,null,null,null,null,null,null,null,null,null,null,null,null,null,null,{"$f":"#REF!","v":{"$error":"#REF!"}}," ","04md",{"$f":"'[1]DECACI DUBL 16'!E32","v":""},{"$f":"'[1]DECACI DUBL 16'!F32","v":""},{"$f":"CONCATENATE($U448,\" \",$V448)","v":" "},{"$f":"'[1]DECACI DUBL 16'!E36","v":""},{"$f":"'[1]DECACI DUBL 16'!F36","v":""},{"$f":"CONCATENATE($X448,\" \",$Y448)","v":" "}]
[null,null,null,null,null,null,null,null,null,null,null,null,null,null,null,null,null,{"$f":"#REF!","v":{"$error":"#REF!"}}," ","05md",{"$f":"'[1]DECACI DUBL 16'!E40","v":""},{"$f":"'[1]DECACI DUBL 16'!F40","v":""},{"$f":"CONCATENATE($U449,\" \",$V449)","v":" "},{"$f":"'[1]DECACI DUBL 16'!E44","v":""},{"$f":"'[1]DECACI DUBL 16'!F44","v":""},{"$f":"CONCATENATE($X449,\" \",$Y449)","v":" "}]
[null,null,null,null,null,null,null,null,null,null,null,null,null,null,null,null,null,{"$f":"#REF!","v":{"$error":"#REF!"}},"  (0)","06md",{"$f":"'[1]DECACI DUBL 16'!E48","v":""},{"$f":"'[1]DECACI DUBL 16'!F48","v":""},{"$f":"CONCATENATE($U450,\" \",$V450)","v":" "},{"$f":"'[1]DECACI DUBL 16'!E52","v":""},{"$f":"'[1]DECACI DUBL 16'!F52","v":""},{"$f":"CONCATENATE($X450,\" \",$Y450,\" \",\"(\",'[1]DECACI DUBL 16'!$D$51,\")\")","v":"  (0)"}]
[null,null,null,null,null,null,null,null,null,null,null,null,null,null,null,null,null,{"$f":"#REF!","v":{"$error":"#REF!"}}," ","07md",{"$f":"'[1]DECACI DUBL 16'!E56","v":""},{"$f":"'[1]DECACI DUBL 16'!F56","v":""},{"$f":"CONCATENATE($U451,\" \",$V451)","v":" "},{"$f":"'[1]DECACI DUBL 16'!E60","v":""},{"$f":"'[1]DECACI DUBL 16'!F60","v":""},{"$f":"CONCATENATE($X451,\" \",$Y451)","v":" "}]
[null,null,null,null,null,null,null,null,null,null,null,null,null,null,null,null,null,{"$f":"#REF!","v":{"$error":"#REF!"}},"  (0)","08md",{"$f":"'[1]DECACI DUBL 16'!E64","v":""},{"$f":"'[1]DECACI DUBL 16'!F64","v":""},{"$f":"CONCATENATE($U452,\" \",$V452)","v":" "},{"$f":"'[1]DECACI DUBL 16'!E68","v":""},{"$f":"'[1]DECACI DUBL 16'!F68","v":""},{"$f":"CONCATENATE($X452,\" \",$Y452,\" \",\"(\",'[1]DECACI DUBL 16'!$D$67,\")\")","v":"  (0)"}]
[null,null,null,null,null,null,null,null,null,null,null,null,null,null,null,null,null,{"$f":"IF(ISBLANK('[1]DECACI DUBL 16'!$I$18),CONCATENATE(#REF!,\"/\",U446,,\" ili\"),IF(OR('[1]DECACI DUBL 16'!$I$18=\"a\",'[1]DECACI DUBL 16'!$I$18=\"as\"),#REF!,#REF!))","v":{"$error":"#REF!"}},{"$f":"IF(ISBLANK('[1]DECACI DUBL 16'!$I$18),CONCATENATE(#REF!,\"/\",X446),IF(OR('[1]DECACI DUBL 16'!$I$18=\"b\",'[1]DECACI DUBL 16'!$I$18=\"bs\"),Z446,W446))","v":" "},"09md",{"$f":"'[1]DECACI DUBL 16'!J10","v":""},null,{"$f":"IF(ISBLANK('[1]DECACI DUBL 16'!$I$10),$Z445,IF($U453=$U445,$W445,IF($U453=$X445,$Z445,\"\")))","v":"  (0)"},{"$f":"'[1]DECACI DUBL 16'!J18","v":""},null,{"$f":"IF(ISBLANK('[1]DECACI DUBL 16'!$I$18),$W446,IF($X453=$U446,$W446,IF($X453=$X446,$Z446,\"\")))","v":" "}]
[null,null,null,null,null,null,null,null,null,null,null,null,null,null,null,null,null,{"$f":"IF(ISBLANK('[1]DECACI DUBL 16'!$I$34),CONCATENATE(#REF!,\"/\",U448,,\" ili\"),IF(OR('[1]DECACI DUBL 16'!$I$34=\"a\",'[1]DECACI DUBL 16'!$I$34=\"as\"),#REF!,#REF!))","v":{"$error":"#REF!"}},{"$f":"IF(ISBLANK('[1]DECACI DUBL 16'!$I$34),CONCATENATE(#REF!,\"/\",X448),IF(OR('[1]DECACI DUBL 16'!$I$34=\"b\",'[1]DECACI DUBL 16'!$I$34=\"bs\"),Z448,W448))","v":" "},"10md",{"$f":"'[1]DECACI DUBL 16'!J26","v":""},null,{"$f":"IF(ISBLANK('[1]DECACI DUBL 16'!$I$26),$Z447,IF($U454=$U447,$W447,IF($U454=$X447,$Z447,\"\")))","v":"  (0)"},{"$f":"'[1]DECACI DUBL 16'!J34","v":""},null,{"$f":"IF(ISBLANK('[1]DECACI DUBL 16'!$I$34),$W448,IF($X454=$U448,$W448,IF($X454=$X448,$Z448,\"\")))","v":" "}]
[null,null,null,null,null,null,null,null,null,null,null,null,null,null,null,null,null,{"$f":"IF(ISBLANK('[1]DECACI DUBL 16'!$I$50),CONCATENATE(#REF!,\"/\",U450,,\" ili\"),IF(OR('[1]DECACI DUBL 16'!$I$50=\"a\",'[1]DECACI DUBL 16'!$I$50=\"as\"),#REF!,#REF!))","v":{"$error":"#REF!"}},{"$f":"IF(ISBLANK('[1]DECACI DUBL 16'!$I$50),CONCATENATE(#REF!,\"/\",X450,\" (\",'[1]DECACI DUBL 16'!$D$51,\")\"),IF(OR('[1]DECACI DUBL 16'!$I$50=\"b\",'[1]DECACI DUBL 16'!$I$50=\"bs\"),Z450,W450))","v":" "},"11md",{"$f":"'[1]DECACI DUBL 16'!J42","v":""},null,{"$f":"IF(ISBLANK('[1]DECACI DUBL 16'!$I$42),$Z449,IF($U455=$U449,$W449,IF($U455=$X449,$Z449,\"\")))","v":" "},{"$f":"'[1]DECACI DUBL 16'!J50","v":""},null,{"$f":"IF(ISBLANK('[1]DECACI DUBL 16'!$I$50),$W450,IF($X455=$U450,$W450,IF($X455=$X450,$Z450,\"\")))","v":" "}]
[null,null,null,null,null,null,null,null,null,null,null,null,null,null,null,null,null,{"$f":"IF(ISBLANK('[1]DECACI DUBL 16'!$I$66),CONCATENATE(#REF!,\"/\",U452,,\" ili\"),IF(OR('[1]DECACI DUBL 16'!$I$66=\"a\",'[1]DECACI DUBL 16'!$I$66=\"as\"),#REF!,#REF!))","v":{"$error":"#REF!"}},{"$f":"IF(ISBLANK('[1]DECACI DUBL 16'!$I$66),CONCATENATE(#REF!,\"/\",X452,\" (2)\"),IF(OR('[1]DECACI DUBL 16'!$I$66=\"b\",'[1]DECACI DUBL 16'!$I$66=\"bs\"),Z452,W452))","v":" "},"12md",{"$f":"'[1]DECACI DUBL 16'!J58","v":""},null,{"$f":"IF(ISBLANK('[1]DECACI DUBL 16'!$I$58),$Z451,IF($U456=$U451,$W451,IF($U456=$X451,$Z451,\"\")))","v":" "},{"$f":"'[1]DECACI DUBL 16'!J66","v":""},null,{"$f":"IF(ISBLANK('[1]DECACI DUBL 16'!$I$66),$W452,IF($X456=$U452,$W452,IF($X456=$X452,$Z452,\"\")))","v":" "}]
[null,null,null,null,null,null,null,null,null,null,null,null,null,null,null,null,null,{"$f":"IF(ISBLANK('[1]DECACI DUBL 16'!$K$30),CONCATENATE(#REF!,\"/\",U454,AE457,\" ili\"),IF(OR('[1]DECACI DUBL 16'!$K$30=\"a\",'[1]DECACI DUBL 16'!$K$30=\"as\"),#REF!,#REF!))","v":{"$error":"#REF!"}},{"$f":"IF(ISBLANK('[1]DECACI DUBL 16'!$K$30),CONCATENATE(#REF!,\"/\",X454,),IF(OR('[1]DECACI DUBL 16'!$K$30=\"b\",'[1]DECACI DUBL 16'!$K$30=\"bs\"),Z454,W454))","v":"  (0)"},"13md",{"$f":"'[1]DECACI DUBL 16'!L14","v":""},null,{"$f":"IF(ISBLANK('[1]DECACI DUBL 16'!$K$14),$Z453,IF($U457=$U453,$W453,IF($U457=$X453,$Z453,\"\")))","v":"  (0)"},{"$f":"'[1]DECACI DUBL 16'!L30","v":""},null,{"$f":"IF(ISBLANK('[1]DECACI DUBL 16'!$K$30),$W454,IF($X457=$U454,$W454,IF($X457=$X454,$Z454,\"\")))","v":"  (0)"},null,null,{"$f":"IF('[1]DECACI DUBL 16'!$I$10=\"as\",CONCATENATE(\" (\",'[1]DECACI DUBL 16'!$D$7,\")\"),\"\")","v":""},null,{"$f":"IF('[1]DECACI DUBL 16'!$I$26=\"as\",CONCATENATE(\" (\",'[1]DECACI DUBL 16'!$D$23,\")\"),\"\")","v":""}]
[null,null,null,null,null,null,null,null,null,null,null,null,null,null,null,null,null,{"$f":"IF(ISBLANK('[1]DECACI DUBL 16'!$K$62),CONCATENATE(#REF!,\"/\",U456,,\" ili\"),IF(OR('[1]DECACI DUBL 16'!$K$62=\"a\",'[1]DECACI DUBL 16'!$K$62=\"as\"),#REF!,#REF!))","v":{"$error":"#REF!"}},{"$f":"IF(ISBLANK('[1]DECACI DUBL 16'!$K$62),CONCATENATE(#REF!,\"/\",X456,AF458),IF(OR('[1]DECACI DUBL 16'!$K$62=\"b\",'[1]DECACI DUBL 16'!$K$62=\"bs\"),Z456,W456))","v":" "},"14md",{"$f":"'[1]DECACI DUBL 16'!L46","v":""},null,{"$f":"IF(ISBLANK('[1]DECACI DUBL 16'!$K$46),$Z455,IF($U458=$U455,$W455,IF($U458=$X455,$Z455,\"\")))","v":" "},{"$f":"'[1]DECACI DUBL 16'!L62","v":""},null,{"$f":"IF(ISBLANK('[1]DECACI DUBL 16'!$K$62),$W456,IF($X458=$U456,$W456,IF($X458=$X456,$Z456,\"\")))","v":" "},null,null,null,{"$f":"IF('[1]DECACI DUBL 16'!$I$50=\"bs\",CONCATENATE(\" (\",'[1]DECACI DUBL 16'!$D$51,\")\"),\"\")","v":""},null,{"$f":"IF('[1]DECACI DUBL 16'!$I$66=\"bs\",CONCATENATE(\" (\",'[1]DECACI DUBL 16'!$D$67,\")\"),\"\")","v":""}]
[null,null,null,null,null,null,null,null,null,null,null,null,null,null,null,null,null,{"$f":"IF(ISBLANK('[1]DECACI DUBL 16'!$M$54),CONCATENATE(#REF!,\"/\",U458,AE459,\" ili\"),IF(OR('[1]DECACI DUBL 16'!$M$54=\"a\",'[1]DECACI DUBL 16'!$M$54=\"as\"),#REF!,#REF!))","v":{"$error":"#REF!"}},{"$f":"IF(ISBLANK('[1]DECACI DUBL 16'!$M$54),CONCATENATE(#REF!,\"/\",X458,AF459),IF(OR('[1]DECACI DUBL 16'!$M$54=\"b\",'[1]DECACI DUBL 16'!$M$54=\"bs\"),Z458,W458))","v":" "},"15md",{"$f":"'[1]DECACI DUBL 16'!N22","v":""},null,{"$f":"IF(ISBLANK('[1]DECACI DUBL 16'!$M$22),$Z457,IF($U459=$U457,$W457,IF($U459=$X457,$Z457,\"\")))","v":"  (0)"},{"$f":"'[1]DECACI DUBL 16'!N54","v":""},null,{"$f":"IF(ISBLANK('[1]DECACI DUBL 16'!$M$54),$W458,IF($X459=$U458,$W458,IF($X459=$X458,$Z458,\"\")))","v":" "},null,null,{"$f":"IF('[1]DECACI DUBL 16'!$K$14=\"as\",CONCATENATE(\" (\",'[1]DECACI DUBL 16'!$D$7,\")\"),\"\")","v":""},{"$f":"IF('[1]DECACI DUBL 16'!$K$30=\"as\",CONCATENATE(\" (\",'[1]DECACI DUBL 16'!$D$23,\")\"),\"\")","v":""},{"$f":"IF('[1]DECACI DUBL 16'!$K$46=\"bs\",CONCATENATE(\" (\",'[1]DECACI DUBL 16'!$D$51,\")\"),\"\")","v":""},{"$f":"IF('[1]DECACI DUBL 16'!$K$62=\"bs\",CONCATENATE(\" (\",'[1]DECACI DUBL 16'!$D$67,\")\"),\"\")","v":""}]
[null,null,null,null,null,null,null,null,null,null,null,null,null,null,null,null,null,{"$f":"#REF!","v":{"$error":"#REF!"}},{"$f":"Z460","v":{"$error":"#REF!"}},"01zd",{"$f":"#REF!","v":{"$error":"#REF!"}},{"$f":"#REF!","v":{"$error":"#REF!"}},{"$f":"CONCATENATE($U460,\" \",$V460,\" \",\"(\",#REF!,\")\")","v":{"$error":"#REF!"}},{"$f":"#REF!","v":{"$error":"#REF!"}},{"$f":"#REF!","v":{"$error":"#REF!"}},{"$f":"CONCATENATE($X460,\" \",$Y460)","v":{"$error":"#REF!"}}]
[null,null,null,null,null,null,null,null,null,null,null,null,null,null,null,null,null,{"$f":"#REF!","v":{"$error":"#REF!"}},{"$error":"#REF!"},"02zd",{"$f":"#REF!","v":{"$error":"#REF!"}},{"$f":"#REF!","v":{"$error":"#REF!"}},{"$f":"CONCATENATE($U461,\" \",$V461)","v":{"$error":"#REF!"}},{"$f":"#REF!","v":{"$error":"#REF!"}},{"$f":"#REF!","v":{"$error":"#REF!"}},{"$f":"CONCATENATE($X461,\" \",$Y461)","v":{"$error":"#REF!"}}]
[null,null,null,null,null,null,null,null,null,null,null,null,null,null,null,null,null,{"$f":"#REF!","v":{"$error":"#REF!"}},{"$error":"#REF!"},"03zd",{"$f":"#REF!","v":{"$error":"#REF!"}},{"$f":"#REF!","v":{"$error":"#REF!"}},{"$f":"CONCATENATE($U462,\" \",$V462,\" \",\"(\",#REF!,\")\")","v":{"$error":"#REF!"}},{"$f":"#REF!","v":{"$error":"#REF!"}},{"$f":"#REF!","v":{"$error":"#REF!"}},{"$f":"CONCATENATE($X462,\" \",$Y462)","v":{"$error":"#REF!"}}]
[null,null,null,null,null,null,null,null,null,null,null,null,null,null,null,null,null,{"$f":"#REF!","v":{"$error":"#REF!"}},{"$error":"#REF!"},"04zd",{"$f":"#REF!","v":{"$error":"#REF!"}},{"$f":"#REF!","v":{"$error":"#REF!"}},{"$f":"CONCATENATE($U463,\" \",$V463)","v":{"$error":"#REF!"}},{"$f":"#REF!","v":{"$error":"#REF!"}},{"$f":"#REF!","v":{"$error":"#REF!"}},{"$f":"CONCATENATE($X463,\" \",$Y463)","v":{"$error":"#REF!"}}]
[null,null,null,null,null,null,null,null,null,null,null,null,null,null,null,null,null,{"$f":"#REF!","v":{"$error":"#REF!"}},{"$error":"#REF!"},"05zd",{"$f":"#REF!","v":{"$error":"#REF!"}},{"$f":"#REF!","v":{"$error":"#REF!"}},{"$f":"CONCATENATE($U464,\" \",$V464)","v":{"$error":"#REF!"}},{"$f":"#REF!","v":{"$error":"#REF!"}},{"$f":"#REF!","v":{"$error":"#REF!"}},{"$f":"CONCATENATE($X464,\" \",$Y464)","v":{"$error":"#REF!"}}]
[null,null,null,null,null,null,null,null,null,null,null,null,null,null,null,null,null,{"$f":"#REF!","v":{"$error":"#REF!"}},{"$error":"#REF!"},"06zd",{"$f":"#REF!","v":{"$error":"#REF!"}},{"$f":"#REF!","v":{"$error":"#REF!"}},{"$f":"CONCATENATE($U465,\" \",$V465)","v":{"$error":"#REF!"}},{"$f":"#REF!","v":{"$error":"#REF!"}},{"$f":"#REF!","v":{"$error":"#REF!"}},{"$f":"CONCATENATE($X465,\" \",$Y465,\" \",\"(\",#REF!,\")\")","v":{"$error":"#REF!"}}]
[null,null,null,null,null,null,null,null,null,null,null,null,null,null,null,null,null,{"$f":"#REF!","v":{"$error":"#REF!"}},{"$error":"#REF!"},"07zd",{"$f":"#REF!","v":{"$error":"#REF!"}},{"$f":"#REF!","v":{"$error":"#REF!"}},{"$f":"CONCATENATE($U466,\" \",$V466)","v":{"$error":"#REF!"}},{"$f":"#REF!","v":{"$error":"#REF!"}},{"$f":"#REF!","v":{"$error":"#REF!"}},{"$f":"CONCATENATE($X466,\" \",$Y466)","v":{"$error":"#REF!"}}]
[null,null,null,null,null,null,null,null,null,null,null,null,null,null,null,null,null,{"$f":"#REF!","v":{"$error":"#REF!"}},{"$error":"#REF!"},"08zd",{"$f":"#REF!","v":{"$error":"#REF!"}},{"$f":"#REF!","v":{"$error":"#REF!"}},{"$f":"CONCATENATE($U467,\" \",$V467)","v":{"$error":"#REF!"}},{"$f":"#REF!","v":{"$error":"#REF!"}},{"$f":"#REF!","v":{"$error":"#REF!"}},{"$f":"CONCATENATE($X467,\" \",$Y467,\" \",\"(\",#REF!,\")\")","v":{"$error":"#REF!"}}]
[null,null,null,null,null,null,null,null,null,null,null,null,null,null,null,null,null,{"$f":"IF(ISBLANK(#REF!),CONCATENATE(#REF!,\"/\",U461,,\" ili\"),IF(OR(#REF!=\"a\",#REF!=\"as\"),#REF!,#REF!))","v":{"$error":"#REF!"}},{"$f":"IF(ISBLANK(#REF!),CONCATENATE(#REF!,\"/\",X461),IF(OR(#REF!=\"b\",#REF!=\"bs\"),Z461,W461))","v":{"$error":"#REF!"}},"09zd",{"$f":"#REF!","v":{"$error":"#REF!"}},null,{"$f":"IF(ISBLANK(#REF!),$Z460,IF($U468=$U460,$W460,IF($U468=$X460,$Z460,\"\")))","v":{"$error":"#REF!"}},{"$f":"#REF!","v":{"$error":"#REF!"}},null,{"$f":"IF(ISBLANK(#REF!),$W461,IF($X468=$U461,$W461,IF($X468=$X461,$Z461,\"\")))","v":{"$error":"#REF!"}}]
[null,null,null,null,null,null,null,null,null,null,null,null,null,null,null,null,null,{"$f":"IF(ISBLANK(#REF!),CONCATENATE(#REF!,\"/\",U463,,\" ili\"),IF(OR(#REF!=\"a\",#REF!=\"as\"),#REF!,#REF!))","v":{"$error":"#REF!"}},{"$f":"IF(ISBLANK(#REF!),CONCATENATE(#REF!,\"/\",X463),IF(OR(#REF!=\"b\",#REF!=\"bs\"),Z463,W463))","v":{"$error":"#REF!"}},"10zd",{"$f":"#REF!","v":{"$error":"#REF!"}},null,{"$f":"IF(ISBLANK(#REF!),$Z462,IF($U469=$U462,$W462,IF($U469=$X462,$Z462,\"\")))","v":{"$error":"#REF!"}},{"$f":"#REF!","v":{"$error":"#REF!"}},null,{"$f":"IF(ISBLANK(#REF!),$W463,IF($X469=$U463,$W463,IF($X469=$X463,$Z463,\"\")))","v":{"$error":"#REF!"}}]
[null,null,null,null,null,null,null,null,null,null,null,null,null,null,null,null,null,{"$f":"IF(ISBLANK(#REF!),CONCATENATE(#REF!,\"/\",U465,,\" ili\"),IF(OR(#REF!=\"a\",#REF!=\"as\"),#REF!,#REF!))","v":{"$error":"#REF!"}},{"$f":"IF(ISBLANK(#REF!),CONCATENATE(#REF!,\"/\",X465,\" (\",#REF!,\")\"),IF(OR(#REF!=\"b\",#REF!=\"bs\"),Z465,W465))","v":{"$error":"#REF!"}},"11zd",{"$f":"#REF!","v":{"$error":"#REF!"}},null,{"$f":"IF(ISBLANK(#REF!),$Z464,IF($U470=$U464,$W464,IF($U470=$X464,$Z464,\"\")))","v":{"$error":"#REF!"}},{"$f":"#REF!","v":{"$error":"#REF!"}},null,{"$f":"IF(ISBLANK(#REF!),$W465,IF($X470=$U465,$W465,IF($X470=$X465,$Z465,\"\")))","v":{"$error":"#REF!"}}]
[null,null,null,null,null,null,null,null,null,null,null,null,null,null,null,null,null,{"$f":"IF(ISBLANK(#REF!),CONCATENATE(#REF!,\"/\",U467,,\" ili\"),IF(OR(#REF!=\"a\",#REF!=\"as\"),#REF!,#REF!))","v":{"$error":"#REF!"}},{"$f":"IF(ISBLANK(#REF!),CONCATENATE(#REF!,\"/\",X467,\" (2)\"),IF(OR(#REF!=\"b\",#REF!=\"bs\"),Z467,W467))","v":{"$error":"#REF!"}},"12zd",{"$f":"#REF!","v":{"$error":"#REF!"}},null,{"$f":"IF(ISBLANK(#REF!),$Z466,IF($U471=$U466,$W466,IF($U471=$X466,$Z466,\"\")))","v":{"$error":"#REF!"}},{"$f":"#REF!","v":{"$error":"#REF!"}},null,{"$f":"IF(ISBLANK(#REF!),$W467,IF($X471=$U467,$W467,IF($X471=$X467,$Z467,\"\")))","v":{"$error":"#REF!"}}]
[null,null,null,null,null,null,null,null,null,null,null,null,null,null,null,null,null,{"$f":"IF(ISBLANK(#REF!),CONCATENATE(#REF!,\"/\",U469,AE472,\" ili\"),IF(OR(#REF!=\"a\",#REF!=\"as\"),#REF!,#REF!))","v":{"$error":"#REF!"}},{"$f":"IF(ISBLANK(#REF!),CONCATENATE(#REF!,\"/\",X469,),IF(OR(#REF!=\"b\",#REF!=\"bs\"),Z469,W469))","v":{"$error":"#REF!"}},"13zd",{"$f":"#REF!","v":{"$error":"#REF!"}},null,{"$f":"IF(ISBLANK(#REF!),$Z468,IF($U472=$U468,$W468,IF($U472=$X468,$Z468,\"\")))","v":{"$error":"#REF!"}},{"$f":"#REF!","v":{"$error":"#REF!"}},null,{"$f":"IF(ISBLANK(#REF!),$W469,IF($X472=$U469,$W469,IF($X472=$X469,$Z469,\"\")))","v":{"$error":"#REF!"}},null,null,{"$f":"IF(#REF!=\"as\",CONCATENATE(\" (\",#REF!,\")\"),\"\")","v":{"$error":"#REF!"}},null,{"$f":"IF(#REF!=\"as\",CONCATENATE(\" (\",#REF!,\")\"),\"\")","v":{"$error":"#REF!"}}]
[null,null,null,null,null,null,null,null,null,null,null,null,null,null,null,null,null,{"$f":"IF(ISBLANK(#REF!),CONCATENATE(#REF!,\"/\",U471,,\" ili\"),IF(OR(#REF!=\"a\",#REF!=\"as\"),#REF!,#REF!))","v":{"$error":"#REF!"}},{"$f":"IF(ISBLANK(#REF!),CONCATENATE(#REF!,\"/\",X471,AF473),IF(OR(#REF!=\"b\",#REF!=\"bs\"),Z471,W471))","v":{"$error":"#REF!"}},"14zd",{"$f":"#REF!","v":{"$error":"#REF!"}},null,{"$f":"IF(ISBLANK(#REF!),$Z470,IF($U473=$U470,$W470,IF($U473=$X470,$Z470,\"\")))","v":{"$error":"#REF!"}},{"$f":"#REF!","v":{"$error":"#REF!"}},null,{"$f":"IF(ISBLANK(#REF!),$W471,IF($X473=$U471,$W471,IF($X473=$X471,$Z471,\"\")))","v":{"$error":"#REF!"}},null,null,null,{"$f":"IF(#REF!=\"bs\",CONCATENATE(\" (\",#REF!,\")\"),\"\")","v":{"$error":"#REF!"}},null,{"$f":"IF(#REF!=\"bs\",CONCATENATE(\" (\",#REF!,\")\"),\"\")","v":{"$error":"#REF!"}}]
[null,null,null,null,null,null,null,null,null,null,null,null,null,null,null,null,null,{"$f":"IF(ISBLANK(#REF!),CONCATENATE(#REF!,\"/\",U473,AE474,\" ili\"),IF(OR(#REF!=\"a\",#REF!=\"as\"),#REF!,#REF!))","v":{"$error":"#REF!"}},{"$f":"IF(ISBLANK(#REF!),CONCATENATE(#REF!,\"/\",X473,AF474),IF(OR(#REF!=\"b\",#REF!=\"bs\"),Z473,W473))","v":{"$error":"#REF!"}},"15zd",{"$f":"#REF!","v":{"$error":"#REF!"}},null,{"$f":"IF(ISBLANK(#REF!),$Z472,IF($U474=$U472,$W472,IF($U474=$X472,$Z472,\"\")))","v":{"$error":"#REF!"}},{"$f":"#REF!","v":{"$error":"#REF!"}},null,{"$f":"IF(ISBLANK(#REF!),$W473,IF($X474=$U473,$W473,IF($X474=$X473,$Z473,\"\")))","v":{"$error":"#REF!"}},null,null,{"$f":"IF(#REF!=\"as\",CONCATENATE(\" (\",#REF!,\")\"),\"\")","v":{"$error":"#REF!"}},{"$f":"IF(#REF!=\"as\",CONCATENATE(\" (\",#REF!,\")\"),\"\")","v":{"$error":"#REF!"}},{"$f":"IF(#REF!=\"bs\",CONCATENATE(\" (\",#REF!,\")\"),\"\")","v":{"$error":"#REF!"}},{"$f":"IF(#REF!=\"bs\",CONCATENATE(\" (\",#REF!,\")\"),\"\")","v":{"$error":"#REF!"}}]